{"text_format":"1","workbook":"xlsx","n_sheets":9,"sheets":["Vysvětlivky","Příklad 1","Příklad 2","H298CEB","Seznam signálů","Nap.hladiny","Pole","IO-KOD","104-TI"],"not_rendered":{"charts":0,"images":2,"macros":1,"external_links":0,"defined_names":8,"comments":4,"pivot_tables":0},"unopened":[],"bounds":{"document_bytes":16777216,"sheet_cells":100000,"rows_first":2000,"rows_last":500,"rows_between":2000,"halvings":0,"cell_chars":16384,"cell_head_chars":4096},"cells_cut":0,"cells_raw":0,"read":"whole","date_system":"1900"}

{"sheet":"Vysvětlivky","index":0,"n_rows":38,"n_cols":32,"rows_kept":38,"cut":false,"hidden":false,"merged":[[3,25,3,29],[4,12,4,16],[4,22,4,23],[0,0,0,6],[1,0,1,6],[2,0,2,6],[3,1,3,6],[3,9,3,23]]}
["Seznam signálů SCADA - Výrobny",null,null,null,null,null,null,"Změněno dne: 14. 7. 2023"]
["Vysvětlivky"]
[]
[null,"Textová adresa (TA)",null,null,null,null,null,null,null,"IEC-60870-5-101",null,null,null,null,null,null,null,null,null,null,null,null,null,null,null,"Interpretace dat"]
["Příznak","Označení stanice PREdi","Napěťová hladina","Číslo pole","Typ signálu","Normované označení","Název signálu","Textová adresa",null,"ASDU Address","ASDU\nHigh Byte","ASDU\nLow Byte","Pomocné",null,null,null,null,{"$f":"\"Počet duplicit v IOA = \" &COUNTIF(R7:R63, \"DUPLICITA\")","v":"Počet duplicit v IOA = 0"},{"$f":"IF(COUNTIF(R7:R63, \"DUPLICITA\")>0,\"DUPLICITA\",\"Information Object Address\")","v":"Information Object Address"},"IOA\nHigh Byte","IOA\nMid Byte","IOA\nLow Byte","Datový typ",null,null,"0 / 00","1 / 01",10,11,"Jednotka",null,"Poznámka"]
["P","TA_STA","TA_NAP","TA_POLE","TA_TYP","TA_OZN","TA_Popis","TA_ADR","x","CAASDU_suma","CAASDU2","CAASDU1","A","B","C","D","E",{"$f":"\"IOA = \" &COUNTIF(R7:R63, \"DUPLICITA\")","v":"IOA = 0"},"IOA_suma","IOA3","IOA2","IOA1","TI_IEC","TI_OZN","x","LAB0","LAB1","LAB2","LAB3","UNIT","x","POZN"]
[null,"TS1234",22,4,"Z","QM","Vypínač QM - povel","TS1234.22.4.Z.QM",null,41234,161,18,3,4,10,1,0,"OK",3801348,58,1,4,46,"C_DC_NA_1",null,null,"VYPNOUT","ZAPNOUT"]
[null,"TS1234",22,4,"S","QM","Vypínač QM - stav","TS1234.22.4.S.QM",null,41234,161,18,3,4,0,1,0,"OK",3145988,48,1,4,31,"M_DP_TB_1",null,"MEZIPOLOHA","VYPNUTO","ZAPNUTO","PORUCHA"]
[null,"TS1234",22,4,"S","Q6","Odpojovač Q6 - stav","TS1234.22.4.S.Q6",null,41234,161,18,3,4,0,17,0,"OK",3150084,48,17,4,31,"M_DP_TB_1",null,"MEZIPOLOHA","VYPNUTO","ZAPNUTO","PORUCHA"]
[null,"TS1234",22,4,"S","QE6","Uzemňovač QE6 - stav","TS1234.22.4.S.QE6",null,41234,161,18,3,4,0,96,0,"OK",3170308,48,96,4,31,"M_DP_TB_1",null,"MEZIPOLOHA","VYPNUTO","ZAPNUTO","PORUCHA"]
{"$rows_left_out":29}
{"sheet":"Příklad 1","index":1,"n_rows":38,"n_cols":32,"rows_kept":38,"cut":false,"hidden":false,"merged":[[3,25,3,29],[4,12,4,16],[4,22,4,23],[0,0,0,6],[1,0,1,6],[2,0,2,6],[3,1,3,6],[3,9,3,23]]}
["Seznam signálů SCADA - Výrobny"]
["Příklad 1"]
[]
[null,"Textová adresa (TA)",null,null,null,null,null,null,null,"IEC-60870-5-101",null,null,null,null,null,null,null,null,null,null,null,null,null,null,null,"Interpretace dat"]
["Příznak","Označení stanice PREdi","Napěťová hladina","Číslo pole","Typ signálu","Normované označení","Název signálu","Textová adresa",null,"ASDU Address","ASDU\nHigh Byte","ASDU\nLow Byte","Pomocné",null,null,null,null,{"$f":"\"Počet duplicit v IOA = \" &COUNTIF(R7:R40, \"DUPLICITA\")","v":"Počet duplicit v IOA = 0"},{"$f":"IF(COUNTIF(R7:R40, \"DUPLICITA\")>0,\"DUPLICITA\",\"Information Object Address\")","v":"Information Object Address"},"IOA\nHigh Byte","IOA\nMid Byte","IOA\nLow Byte","Datový typ",null,null,"0 / 00","1 / 01",10,11,"Jednotka",null,"Poznámka"]
["P","TA_STA","TA_NAP","TA_POLE","TA_TYP","TA_OZN","TA_Popis","TA_ADR","x","CAASDU_suma","CAASDU2","CAASDU1","A","B","C","D","E",{"$f":"\"IOA = \" &COUNTIF(R7:R40, \"DUPLICITA\")","v":"IOA = 0"},"IOA_suma","IOA3","IOA2","IOA1","TI_IEC","TI_OZN","x","LAB0","LAB1","LAB2","LAB3","UNIT","x","POZN"]
[null,"TS1234",22,4,"Z","QM","Vypínač QM - povel","TS1234.22.4.Z.QM",null,41234,161,18,3,4,10,1,0,"OK",3801348,58,1,4,46,"C_DC_NA_1",null,null,"VYPNOUT","ZAPNOUT"]
[null,"TS1234",22,4,"S","QM","Vypínač QM - stav","TS1234.22.4.S.QM",null,41234,161,18,3,4,0,1,0,"OK",3145988,48,1,4,31,"M_DP_TB_1",null,"MEZIPOLOHA","VYPNUTO","ZAPNUTO","PORUCHA"]
[null,"TS1234",22,4,"S","Q6","Odpojovač Q6 - stav","TS1234.22.4.S.Q6",null,41234,161,18,3,4,0,17,0,"OK",3150084,48,17,4,31,"M_DP_TB_1",null,"MEZIPOLOHA","VYPNUTO","ZAPNUTO","PORUCHA"]
[null,"TS1234",22,4,"S","QE6","Uzemňovač QE6 - stav","TS1234.22.4.S.QE6",null,41234,161,18,3,4,0,96,0,"OK",3170308,48,96,4,31,"M_DP_TB_1",null,"MEZIPOLOHA","VYPNUTO","ZAPNUTO","PORUCHA"]
{"$rows_left_out":29}
{"sheet":"Příklad 2","index":2,"n_rows":39,"n_cols":32,"rows_kept":39,"cut":false,"hidden":false,"merged":[[3,25,3,29],[4,12,4,16],[4,22,4,23],[0,0,0,6],[1,0,1,6],[2,0,2,6],[3,1,3,6],[3,9,3,23]]}
["Seznam signálů SCADA - Výrobny"]
["Příklad 2"]
[]
[null,"Textová adresa (TA)",null,null,null,null,null,null,null,"IEC-60870-5-101",null,null,null,null,null,null,null,null,null,null,null,null,null,null,null,"Interpretace dat"]
["Příznak","Označení stanice PREdi","Napěťová hladina","Číslo pole","Typ signálu","Normované označení","Název signálu","Textová adresa",null,"ASDU Address","ASDU\nHigh Byte","ASDU\nLow Byte","Pomocné",null,null,null,null,{"$f":"\"Počet duplicit v IOA = \" &COUNTIF(R7:R41, \"DUPLICITA\")","v":"Počet duplicit v IOA = 0"},{"$f":"IF(COUNTIF(R7:R41, \"DUPLICITA\")>0,\"DUPLICITA\",\"Information Object Address\")","v":"Information Object Address"},"IOA\nHigh Byte","IOA\nMid Byte","IOA\nLow Byte","Datový typ",null,null,"0 / 00","1 / 01",10,11,"Jednotka",null,"Poznámka"]
["P","TA_STA","TA_NAP","TA_POLE","TA_TYP","TA_OZN","TA_Popis","TA_ADR","x","CAASDU_suma","CAASDU2","CAASDU1","A","B","C","D","E",{"$f":"\"IOA = \" &COUNTIF(R7:R41, \"DUPLICITA\")","v":"IOA = 0"},"IOA_suma","IOA3","IOA2","IOA1","TI_IEC","TI_OZN","x","LAB0","LAB1","LAB2","LAB3","UNIT","x","POZN"]
[null,"TS1234","NNO","VMS","Z","QM","Vypínač QM - povel","TS1234.NNO.VMS.Z.QM",null,41234,161,18,5,120,10,1,0,"OK",5898616,90,1,120,46,"C_DC_NA_1",null,null,"VYPNOUT","ZAPNOUT"]
[null,"TS1234","NNO","VMS","S","QM","Vypínač QM - stav","TS1234.NNO.VMS.S.QM",null,41234,161,18,5,120,0,1,0,"OK",5243256,80,1,120,31,"M_DP_TB_1",null,"MEZIPOLOHA","VYPNUTO","ZAPNUTO","PORUCHA"]
[null,"TS1234","NNO","VMS","M","UL2","Měření fázového napětí UL2","TS1234.NNO.VMS.M.UL2",null,41234,161,18,5,120,13,10,0,"OK",6097528,93,10,120,13,"M_ME_NC_1",null,null,null,null,null,"V"]
[null,"TS1234","NNO","VMS","M","IL2","Měření proudu IL2","TS1234.NNO.VMS.M.IL2",null,41234,161,18,5,120,13,2,0,"OK",6095480,93,2,120,13,"M_ME_NC_1",null,null,null,null,null,"A"]
{"$rows_left_out":30}
{"sheet":"H298CEB","index":3,"n_rows":16,"n_cols":17,"rows_kept":16,"cut":false,"hidden":false,"merged":[]}
[null,"Zjednodušené logické schéma blokování zapnutí výrobny, v přípdě jednoho jistícího prvku pro oddělovací a rozpadové místo"]
[]
[null,"povel VYP z automatiky výrobny",null,null,null,null,null,null,null,null,null,null,"OR",null,null,null,"výstup VYP na vypínač (oddělovací místo)"]
[]
[]
[]
[]
[]
[null,"povel na blokování ZAP z ED PREdi (H298CEB)",null,null,null,null,null,null,"S","RS"]
[null,null,null,null,null,null,null,null,null,null,"Q",null,null,null,null,null,"signalizace blokování na ED PREdi (H298CEB)"]
{"$rows_left_out":7}
{"sheet":"Seznam signálů","index":4,"n_rows":59,"n_cols":32,"rows_kept":59,"cut":false,"hidden":false,"merged":[[3,25,3,29],[3,1,3,6],[3,9,3,23],[0,1,0,6],[1,1,1,6],[2,1,2,6],[4,12,4,16],[4,22,4,23]]}
["x","Seznam signálů SCADA - Výrobny"]
["x","TS 1234-VM"]
["x"]
[null,"Textová adresa (TA)",null,null,null,null,null,null,null,"IEC-60870-5-101",null,null,null,null,null,null,null,null,null,null,null,null,null,null,null,"Interpretace dat"]
["Příznak","Číslo stanice PREdi","Napěťová hladina","Číslo pole","Typ signálu","Normované označení","Název signálu","Textová adresa",null,"ASDU Address","ASDU\nHigh Byte","ASDU\nLow Byte","Pomocné",null,null,null,null,{"$f":"\"Počet duplicit v IOA = \" &COUNTIF(R7:R59, \"DUPLICITA\")","v":"Počet duplicit v IOA = 0"},{"$f":"IF(COUNTIF(R7:R59, \"DUPLICITA\")>0,\"DUPLICITA\",\"Information Object Address\")","v":"Information Object Address"},"IOA\nHigh Byte","IOA\nMid Byte","IOA\nLow Byte","Datový typ",null,null,"0 / 00","1 / 01",10,11,"Jednotka",null,"Poznámka"]
["P","TA_STA","TA_NAP","TA_POLE","TA_TYP","TA_OZN","TA_Popis","TA_ADR","x","CAASDU_suma","CAASDU2","CAASDU1","A","B","C","D","E",{"$f":"\"IOA = \" &COUNTIF(R7:R59, \"DUPLICITA\")","v":"IOA = 0"},"IOA_suma","IOA3","IOA2","IOA1","TI_IEC","TI_OZN","x","LAB0","LAB1","LAB2","LAB3","UNIT","x","POZN"]
[null,"TS1234","NNO","VMS","Z","QM",{"$f":"IF(F7<>\"\",VLOOKUP(E7&\"|\"&F7,'IO-KOD'!$A$1:$E$70,5,0),\"\")","v":"Vypínač QM - povel"},{"$f":"IF(F7<>\"\",SUBSTITUTE(B7&\".\"&C7&\".\"&D7&\".\"&E7&\".\"&F7,\" \",\"\"),\"\")","v":"TS1234.NNO.VMS.Z.QM"},null,{"$f":"IF(F7<>\"\",MID(B7,3,10)+40000,\"\")","v":41234},{"$f":"IF(J7<>\"\",INT(MOD(J7,65536)/256),\"\")","v":161},{"$f":"IF(J7<>\"\",MOD(J7,256),\"\")","v":18},{"$f":"IF(F7<>\"\",VLOOKUP(C7,Nap.hladiny!$A:$D,2,0),\"\")","v":5},{"$f":"IF(F7<>\"\",VLOOKUP(D7,Pole!$A:$B,2,0),\"\")","v":120},{"$f":"IF(F7<>\"\",VLOOKUP(E7&\"|\"&F7,'IO-KOD'!$A$1:$E$70,3,0),\"\")","v":10},{"$f":"IF(F7<>\"\",VLOOKUP(E7&\"|\"&F7,'IO-KOD'!$A$1:$E$70,4,0),\"\")","v":1},{"$f":"IF(F7<>\"\",VLOOKUP(C7,Nap.hladiny!$A:$D,3,0),\"\")","v":0},{"$f":"IF(F7<>\"\",IF(AND(COUNTIFS($S$7:$S$499, S7,$A$7:$A$499,\"<>N\")>1, S7<>\"\",A7<>\"N\"), \"DUPLICITA\", \"OK\"),\"\")","v":"OK"},{"$f":"IF(F7=\"\",\"\",(M7*2^20)+(O7*2^16)+(P7*2^8)+(Q7*2^7)+N7)","v":5898616},{"$f":"IF(S7<>\"\",(S7-(U7*256)-V7)/65536,\"\")","v":90},{"$f":"IF(S7<>\"\",INT(MOD(S7,65536)/256),\"\")","v":1},{"$f":"IF(S7<>\"\",MOD(S7,256),\"\")","v":120},{"$f":"IF(F7<>\"\",VLOOKUP(E7&\"|\"&F7,'IO-KOD'!$A$1:$H$70,8,0),\"\")","v":46},{"$f":"IF(W7<>\"\",VLOOKUP(W7,'104-TI'!$A:$B,2,0),\"\")","v":"C_DC_NA_1"},null,{"$f":"IF(F7<>\"\",VLOOKUP(E7&\"|\"&F7,'IO-KOD'!$A$1:$M$70,9,0),\"\")","v":"-"},{"$f":"IF(F7<>\"\",VLOOKUP(E7&\"|\"&F7,'IO-KOD'!$A$1:$M$70,10,0),\"\")","v":"VYPNOUT"},{"$f":"IF(F7<>\"\",VLOOKUP(E7&\"|\"&F7,'IO-KOD'!$A$1:$M$70,11,0),\"\")","v":"ZAPNOUT"},{"$f":"IF(F7<>\"\",VLOOKUP(E7&\"|\"&F7,'IO-KOD'!$A$1:$M$70,12,0),\"\")","v":"-"},{"$f":"IF(F7<>\"\",VLOOKUP(E7&\"|\"&F7,'IO-KOD'!$A$1:$M$70,13,0),\"\")","v":"-"}]
[null,"TS1234","NNO","VMS","S","QM",{"$f":"IF(F8<>\"\",VLOOKUP(E8&\"|\"&F8,'IO-KOD'!$A$1:$E$70,5,0),\"\")","v":"Vypínač QM - stav"},"TS1234.NNO.VMS.S.QM",null,{"$f":"IF(F8<>\"\",MID(B8,3,10)+40000,\"\")","v":41234},161,18,{"$f":"IF(F8<>\"\",VLOOKUP(C8,Nap.hladiny!$A:$D,2,0),\"\")","v":5},{"$f":"IF(F8<>\"\",VLOOKUP(D8,Pole!$A:$B,2,0),\"\")","v":120},{"$f":"IF(F8<>\"\",VLOOKUP(E8&\"|\"&F8,'IO-KOD'!$A$1:$E$70,3,0),\"\")","v":0},{"$f":"IF(F8<>\"\",VLOOKUP(E8&\"|\"&F8,'IO-KOD'!$A$1:$E$70,4,0),\"\")","v":1},{"$f":"IF(F8<>\"\",VLOOKUP(C8,Nap.hladiny!$A:$D,3,0),\"\")","v":0},"OK",{"$f":"IF(F8=\"\",\"\",(M8*2^20)+(O8*2^16)+(P8*2^8)+(Q8*2^7)+N8)","v":5243256},80,1,120,{"$f":"IF(F8<>\"\",VLOOKUP(E8&\"|\"&F8,'IO-KOD'!$A$1:$H$70,8,0),\"\")","v":31},{"$f":"IF(W8<>\"\",VLOOKUP(W8,'104-TI'!$A:$B,2,0),\"\")","v":"M_DP_TB_1"},null,{"$f":"IF(F8<>\"\",VLOOKUP(E8&\"|\"&F8,'IO-KOD'!$A$1:$M$70,9,0),\"\")","v":"MEZIPOLOHA"},{"$f":"IF(F8<>\"\",VLOOKUP(E8&\"|\"&F8,'IO-KOD'!$A$1:$M$70,10,0),\"\")","v":"VYPNUTO"},{"$f":"IF(F8<>\"\",VLOOKUP(E8&\"|\"&F8,'IO-KOD'!$A$1:$M$70,11,0),\"\")","v":"ZAPNUTO"},{"$f":"IF(F8<>\"\",VLOOKUP(E8&\"|\"&F8,'IO-KOD'!$A$1:$M$70,12,0),\"\")","v":"PORUCHA"},{"$f":"IF(F8<>\"\",VLOOKUP(E8&\"|\"&F8,'IO-KOD'!$A$1:$M$70,13,0),\"\")","v":"-"}]
[null,"TS1234","NNO","VMS","M","UL2",{"$f":"IF(F9<>\"\",VLOOKUP(E9&\"|\"&F9,'IO-KOD'!$A$1:$E$70,5,0),\"\")","v":"Měření fázového napětí UL2"},"TS1234.NNO.VMS.M.UL2",null,41234,161,18,{"$f":"IF(F9<>\"\",VLOOKUP(C9,Nap.hladiny!$A:$D,2,0),\"\")","v":5},{"$f":"IF(F9<>\"\",VLOOKUP(D9,Pole!$A:$B,2,0),\"\")","v":120},{"$f":"IF(F9<>\"\",VLOOKUP(E9&\"|\"&F9,'IO-KOD'!$A$1:$E$70,3,0),\"\")","v":13},{"$f":"IF(F9<>\"\",VLOOKUP(E9&\"|\"&F9,'IO-KOD'!$A$1:$E$70,4,0),\"\")","v":10},{"$f":"IF(F9<>\"\",VLOOKUP(C9,Nap.hladiny!$A:$D,3,0),\"\")","v":0},"OK",6097528,93,10,120,{"$f":"IF(F9<>\"\",VLOOKUP(E9&\"|\"&F9,'IO-KOD'!$A$1:$H$70,8,0),\"\")","v":13},{"$f":"IF(W9<>\"\",VLOOKUP(W9,'104-TI'!$A:$B,2,0),\"\")","v":"M_ME_NC_1"},null,{"$f":"IF(F9<>\"\",VLOOKUP(E9&\"|\"&F9,'IO-KOD'!$A$1:$M$70,9,0),\"\")","v":"-"},{"$f":"IF(F9<>\"\",VLOOKUP(E9&\"|\"&F9,'IO-KOD'!$A$1:$M$70,10,0),\"\")","v":"-"},{"$f":"IF(F9<>\"\",VLOOKUP(E9&\"|\"&F9,'IO-KOD'!$A$1:$M$70,11,0),\"\")","v":"-"},{"$f":"IF(F9<>\"\",VLOOKUP(E9&\"|\"&F9,'IO-KOD'!$A$1:$M$70,12,0),\"\")","v":"-"},{"$f":"IF(F9<>\"\",VLOOKUP(E9&\"|\"&F9,'IO-KOD'!$A$1:$M$70,13,0),\"\")","v":"V"}]
[null,"TS1234","NNO","VMS","M","IL2",{"$f":"IF(F10<>\"\",VLOOKUP(E10&\"|\"&F10,'IO-KOD'!$A$1:$E$70,5,0),\"\")","v":"Měření proudu IL2"},"TS1234.NNO.VMS.M.IL2",null,41234,161,18,{"$f":"IF(F10<>\"\",VLOOKUP(C10,Nap.hladiny!$A:$D,2,0),\"\")","v":5},{"$f":"IF(F10<>\"\",VLOOKUP(D10,Pole!$A:$B,2,0),\"\")","v":120},{"$f":"IF(F10<>\"\",VLOOKUP(E10&\"|\"&F10,'IO-KOD'!$A$1:$E$70,3,0),\"\")","v":13},{"$f":"IF(F10<>\"\",VLOOKUP(E10&\"|\"&F10,'IO-KOD'!$A$1:$E$70,4,0),\"\")","v":2},{"$f":"IF(F10<>\"\",VLOOKUP(C10,Nap.hladiny!$A:$D,3,0),\"\")","v":0},"OK",6095480,93,2,120,{"$f":"IF(F10<>\"\",VLOOKUP(E10&\"|\"&F10,'IO-KOD'!$A$1:$H$70,8,0),\"\")","v":13},{"$f":"IF(W10<>\"\",VLOOKUP(W10,'104-TI'!$A:$B,2,0),\"\")","v":"M_ME_NC_1"},null,{"$f":"IF(F10<>\"\",VLOOKUP(E10&\"|\"&F10,'IO-KOD'!$A$1:$M$70,9,0),\"\")","v":"-"},{"$f":"IF(F10<>\"\",VLOOKUP(E10&\"|\"&F10,'IO-KOD'!$A$1:$M$70,10,0),\"\")","v":"-"},{"$f":"IF(F10<>\"\",VLOOKUP(E10&\"|\"&F10,'IO-KOD'!$A$1:$M$70,11,0),\"\")","v":"-"},{"$f":"IF(F10<>\"\",VLOOKUP(E10&\"|\"&F10,'IO-KOD'!$A$1:$M$70,12,0),\"\")","v":"-"},{"$f":"IF(F10<>\"\",VLOOKUP(E10&\"|\"&F10,'IO-KOD'!$A$1:$M$70,13,0),\"\")","v":"A"}]
{"$rows_left_out":50}
{"sheet":"Nap.hladiny","index":5,"n_rows":10,"n_cols":4,"rows_kept":10,"cut":false,"hidden":true,"merged":[[0,0,0,3]]}
["Napěťové hladiny"]
["TA_NAP","A","E","Subsystém"]
[110,1,0,"110 kV"]
[35,2,0,"35 kV"]
[22,3,0,"22 kV"]
[10,4,0,"10 kV"]
["NNO",5,0,"0,4 kV odběratele"]
["SPL",6,0,"Společné provozy"]
["NN1",7,0,"0,4 kV"]
["NN2",7,1,"0,4 kV"]
{"$rows_left_out":1}
{"sheet":"Pole","index":6,"n_rows":47,"n_cols":3,"rows_kept":47,"cut":false,"hidden":true,"merged":[[0,0,0,2]]}
["Pole"]
["TA_POLE","B","Poznámka"]
[0,0,"Společné provozy"]
["EZS",0,"Elektronický zabezpečovací systém"]
[1,1]
[2,2]
[3,3]
[4,4]
[5,5]
[6,6]
{"$rows_left_out":38}
{"sheet":"IO-KOD","index":7,"n_rows":58,"n_cols":13,"rows_kept":58,"cut":false,"hidden":true,"merged":[]}
["OZN+TYP","TA_OZN","C","D","POPIS","ZKRÁCENÝ TEXT","TA_TYP","TI_IEC","LAB0","LAB1","LAB2","LAB3","UNIT"]
[{"$f":"G2&\"|\"&B2","v":"S|QM"},"QM",0,1,"Vypínač QM - stav","Vypínač QM","S",31,"MEZIPOLOHA","VYPNUTO","ZAPNUTO","PORUCHA","-"]
[{"$f":"G3&\"|\"&B3","v":"S|Q6"},"Q6",0,17,"Odpojovač Q6 - stav","Odpojovač Q6","S",31,"MEZIPOLOHA","VYPNUTO","ZAPNUTO","PORUCHA","-"]
["S|QE6","QE6",0,96,"Uzemňovač QE6 - stav","Uzemňovač QE6","S",31,"MEZIPOLOHA","VYPNUTO","ZAPNUTO","PORUCHA","-"]
["S|QS1","QS1",0,124,"Odpínač QS1 - stav","Odpínač QS1","S",31,"MEZIPOLOHA","VYPNUTO","ZAPNUTO","PORUCHA","-"]
["S|QSF1","QSF1",0,127,"Odpínač s pojistkou QSF1 - stav","Odpínač QSF1","S",31,"MEZIPOLOHA","VYPNUTO","ZAPNUTO","PORUCHA","-"]
["S|FA1","FA1",0,142,"Jistič FA1 - stav","Jistič FA1","S",31,"MEZIPOLOHA","VYPNUTO","ZAPNUTO","PORUCHA","-"]
["S|FA2","FA2",0,143,"Jistič FA2 - stav","Jistič FA2","S",31,"MEZIPOLOHA","VYPNUTO","ZAPNUTO","PORUCHA","-"]
["S|FA3","FA3",0,144,"Jistič FA3 - stav","Jistič FA3","S",31,"MEZIPOLOHA","VYPNUTO","ZAPNUTO","PORUCHA","-"]
["S|FA4","FA4",0,145,"Jistič FA4 - stav","Jistič FA4","S",31,"MEZIPOLOHA","VYPNUTO","ZAPNUTO","PORUCHA","-"]
{"$rows_left_out":49}
{"sheet":"104-TI","index":8,"n_rows":25,"n_cols":4,"rows_kept":25,"cut":false,"hidden":true,"merged":[[0,0,0,3]]}
["Datové typy IEC 60870-5-101/104"]
["TI_IEC","TI_OZN","Význam - ENG","Význam - CZ"]
[1,"M_SP_NA_1","Single-point information","Jednobitová informace"]
[30,"M_SP_TB_1","Single-point information with time tag","Jednobitová informace s časovou známkou"]
[3,"M_DP_NA_1","Double-point information","Dvoubitová informace"]
[31,"M_DP_TB_1","Double-point information with time tag","Dvoubitová informace s časovou známkou"]
[5,"M_ST_NA_1","Step position information","Signalizace polohy"]
[32,"M_ST_TB_1","Step position information with time tag","Signalizace polohy s časovou známkou"]
[]
[45,"C_SC_NA_1","Single command","Jednobitový povel"]
{"$rows_left_out":15}