{"text_format":"1","workbook":"xlsx","n_sheets":9,"sheets":["Vysvětlivky","Příklad 1","Příklad 2","H298CEB","Seznam signálů","Nap.hladiny","Pole","IO-KOD","104-TI"],"not_rendered":{"charts":0,"images":2,"macros":1,"external_links":0,"defined_names":8,"comments":4,"pivot_tables":0},"unopened":[],"bounds":{"document_bytes":16777216,"sheet_cells":100000,"rows_first":2000,"rows_last":500,"rows_between":2000,"halvings":0,"cell_chars":16384,"cell_head_chars":4096},"cells_cut":0,"cells_raw":0,"read":"whole","date_system":"1900"}

{"sheet":"Vysvětlivky","index":0,"n_rows":38,"n_cols":32,"rows_kept":38,"cut":false,"hidden":false,"merged":[[3,25,3,29],[4,12,4,16],[4,22,4,23],[0,0,0,6],[1,0,1,6],[2,0,2,6],[3,1,3,6],[3,9,3,23]]}
["Seznam signálů SCADA - Výrobny",null,null,null,null,null,null,"Změněno dne: 14. 7. 2023"]
["Vysvětlivky"]
[]
[null,"Textová adresa (TA)",null,null,null,null,null,null,null,"IEC-60870-5-101",null,null,null,null,null,null,null,null,null,null,null,null,null,null,null,"Interpretace dat"]
["Příznak","Označení stanice PREdi","Napěťová hladina","Číslo pole","Typ signálu","Normované označení","Název signálu","Textová adresa",null,"ASDU Address","ASDU\nHigh Byte","ASDU\nLow Byte","Pomocné",null,null,null,null,{"$f":"\"Počet duplicit v IOA = \" &COUNTIF(R7:R63, \"DUPLICITA\")","v":"Počet duplicit v IOA = 0"},{"$f":"IF(COUNTIF(R7:R63, \"DUPLICITA\")>0,\"DUPLICITA\",\"Information Object Address\")","v":"Information Object Address"},"IOA\nHigh Byte","IOA\nMid Byte","IOA\nLow Byte","Datový typ",null,null,"0 / 00","1 / 01",10,11,"Jednotka",null,"Poznámka"]
["P","TA_STA","TA_NAP","TA_POLE","TA_TYP","TA_OZN","TA_Popis","TA_ADR","x","CAASDU_suma","CAASDU2","CAASDU1","A","B","C","D","E",{"$f":"\"IOA = \" &COUNTIF(R7:R63, \"DUPLICITA\")","v":"IOA = 0"},"IOA_suma","IOA3","IOA2","IOA1","TI_IEC","TI_OZN","x","LAB0","LAB1","LAB2","LAB3","UNIT","x","POZN"]
[null,"TS1234",22,4,"Z","QM","Vypínač QM - povel","TS1234.22.4.Z.QM",null,41234,161,18,3,4,10,1,0,"OK",3801348,58,1,4,46,"C_DC_NA_1",null,null,"VYPNOUT","ZAPNOUT"]
[null,"TS1234",22,4,"S","QM","Vypínač QM - stav","TS1234.22.4.S.QM",null,41234,161,18,3,4,0,1,0,"OK",3145988,48,1,4,31,"M_DP_TB_1",null,"MEZIPOLOHA","VYPNUTO","ZAPNUTO","PORUCHA"]
[null,"TS1234",22,4,"S","Q6","Odpojovač Q6 - stav","TS1234.22.4.S.Q6",null,41234,161,18,3,4,0,17,0,"OK",3150084,48,17,4,31,"M_DP_TB_1",null,"MEZIPOLOHA","VYPNUTO","ZAPNUTO","PORUCHA"]
[null,"TS1234",22,4,"S","QE6","Uzemňovač QE6 - stav","TS1234.22.4.S.QE6",null,41234,161,18,3,4,0,96,0,"OK",3170308,48,96,4,31,"M_DP_TB_1",null,"MEZIPOLOHA","VYPNUTO","ZAPNUTO","PORUCHA"]
[null,"TS1234",22,4,"M","UL1-L2","Měření sdruženého napětí L1-L2","TS1234.22.4.M.UL1-L2",null,41234,161,18,3,4,13,16,0,"OK",4001796,61,16,4,13,"M_ME_NC_1",null,null,null,null,null,"kV"]
[null,"TS1234",22,4,"M","IL2","Měření proudu IL2","TS1234.22.4.M.IL2",null,41234,161,18,3,4,13,2,0,"OK",3998212,61,2,4,13,"M_ME_NC_1",null,null,null,null,null,"A"]
[null,"TS1234",22,4,"M","P","Měření činného výkonu P","TS1234.22.4.M.P",null,41234,161,18,3,4,13,22,0,"OK",4003332,61,22,4,13,"M_ME_NC_1",null,null,null,null,null,"kW"]
[null,"TS1234",22,4,"M","Q","Měření jalového výkonu Q","TS1234.22.4.M.Q",null,41234,161,18,3,4,13,23,0,"OK",4003588,61,23,4,13,"M_ME_NC_1",null,null,null,null,null,"kvar"]
[null,"TS1234","NNO","VMS","Z","QM_TEST","Zkušební vypínač - povel","TS1234.NNO.VMS.Z.QM_TEST",null,41234,161,18,5,120,10,255,0,"OK",5963640,90,255,120,46,"C_DC_NA_1",null,null,"VYPNOUT","ZAPNOUT"]
[null,"TS1234","NNO","VMS","S","QM_TEST","Zkušební vypínač - stav","TS1234.NNO.VMS.S.QM_TEST",null,41234,161,18,5,120,0,255,0,"OK",5308280,80,255,120,31,"M_DP_TB_1",null,"MEZIPOLOHA","VYPNUTO","ZAPNUTO","PORUCHA"]
[null,"TS1234","NNO","VMS","P","H835L","Stejnosměrné napájení ovládání - ztráta napětí","TS1234.NNO.VMS.P.H835L",null,41234,161,18,5,120,7,128,0,"OK",5734520,87,128,120,30,"M_SP_TB_1",null,"KONEC","ZAČÁTEK"]
[null,"TS1234","NNO","VMS","Z","SPG100","Stupeň regulace P - výroba 100% - nastavit","TS1234.NNO.VMS.Z.SPG100",null,41234,161,18,5,120,12,81,0,"OK",6050168,92,81,120,45,"C_SC_NA_1",null,"VYPNOUT","ZAPNOUT"]
[null,"TS1234","NNO","VMS","Z","SPG060","Stupeň regulace P - výroba 60% - nastavit","TS1234.NNO.VMS.Z.SPG060",null,41234,161,18,5,120,12,82,0,"OK",6050424,92,82,120,45,"C_SC_NA_1",null,"VYPNOUT","ZAPNOUT"]
[null,"TS1234","NNO","VMS","Z","SPG030","Stupeň regulace P - výroba 30% - nastavit","TS1234.NNO.VMS.Z.SPG030",null,41234,161,18,5,120,12,83,0,"OK",6050680,92,83,120,45,"C_SC_NA_1",null,"VYPNOUT","ZAPNOUT"]
[null,"TS1234","NNO","VMS","Z","SPG000","Stupeň regulace P - výroba 0% - nastavit","TS1234.NNO.VMS.Z.SPG000",null,41234,161,18,5,120,12,84,0,"OK",6050936,92,84,120,45,"C_SC_NA_1",null,"VYPNOUT","ZAPNOUT"]
[null,"TS1234","NNO","VMS","S","SPG100","Stupeň regulace P - výroba 100% - nastaveno","TS1234.NNO.VMS.S.SPG100",null,41234,161,18,5,120,6,232,0,"OK",5695608,86,232,120,30,"M_SP_TB_1",null,"VYPNUTO","ZAPNUTO"]
[null,"TS1234","NNO","VMS","S","SPG060","Stupeň regulace P - výroba 60% - nastaveno","TS1234.NNO.VMS.S.SPG060",null,41234,161,18,5,120,6,233,0,"OK",5695864,86,233,120,30,"M_SP_TB_1",null,"VYPNUTO","ZAPNUTO"]
[null,"TS1234","NNO","VMS","S","SPG030","Stupeň regulace P - výroba 30% - nastaveno","TS1234.NNO.VMS.S.SPG030",null,41234,161,18,5,120,6,234,0,"OK",5696120,86,234,120,30,"M_SP_TB_1",null,"VYPNUTO","ZAPNUTO"]
[null,"TS1234","NNO","VMS","S","SPG000","Stupeň regulace P - výroba 0% - nastaveno","TS1234.NNO.VMS.S.SPG000",null,41234,161,18,5,120,6,235,0,"OK",5696376,86,235,120,30,"M_SP_TB_1",null,"VYPNUTO","ZAPNUTO"]
[null,"TS1234","NNO","VMS","Z","SPFG090C","Stupeň regulace cos fi - 0.90C - nastavit","TS1234.NNO.VMS.Z.SPFG090C",null,41234,161,18,5,120,12,127,0,"OK",6061944,92,127,120,45,"C_SC_NA_1",null,"VYPNOUT","ZAPNOUT"]
[null,"TS1234","NNO","VMS","Z","SPFG095C","Stupeň regulace cos fi - 0.95C - nastavit","TS1234.NNO.VMS.Z.SPFG095C",null,41234,161,18,5,120,12,128,0,"OK",6062200,92,128,120,45,"C_SC_NA_1",null,"VYPNOUT","ZAPNOUT"]
[null,"TS1234","NNO","VMS","Z","SPFG100","Stupeň regulace cos fi - 1.00 - nastavit","TS1234.NNO.VMS.Z.SPFG100",null,41234,161,18,5,120,12,129,0,"OK",6062456,92,129,120,45,"C_SC_NA_1",null,"VYPNOUT","ZAPNOUT"]
[null,"TS1234","NNO","VMS","Z","SPFG095L","Stupeň regulace cos fi - 0.95L - nastavit","TS1234.NNO.VMS.Z.SPFG095L",null,41234,161,18,5,120,12,130,0,"OK",6062712,92,130,120,45,"C_SC_NA_1",null,"VYPNOUT","ZAPNOUT"]
[null,"TS1234","NNO","VMS","Z","SPFG090L","Stupeň regulace cos fi - 0.90L - nastavit","TS1234.NNO.VMS.Z.SPFG090L",null,41234,161,18,5,120,12,131,0,"OK",6062968,92,131,120,45,"C_SC_NA_1",null,"VYPNOUT","ZAPNOUT"]
[null,"TS1234","NNO","VMS","S","SPFG090C","Stupeň regulace cos fi - 0.90C - nastaveno","TS1234.NNO.VMS.S.SPFG090C",null,41234,161,18,5,120,6,226,0,"OK",5694072,86,226,120,30,"M_SP_TB_1",null,"VYPNUTO","ZAPNUTO"]
[null,"TS1234","NNO","VMS","S","SPFG095C","Stupeň regulace cos fi - 0.95C - nastaveno","TS1234.NNO.VMS.S.SPFG095C",null,41234,161,18,5,120,6,227,0,"OK",5694328,86,227,120,30,"M_SP_TB_1",null,"VYPNUTO","ZAPNUTO"]
[null,"TS1234","NNO","VMS","S","SPFG100","Stupeň regulace cos fi - 1.00 - nastaveno","TS1234.NNO.VMS.S.SPFG100",null,41234,161,18,5,120,6,228,0,"OK",5694584,86,228,120,30,"M_SP_TB_1",null,"VYPNUTO","ZAPNUTO"]
[null,"TS1234","NNO","VMS","S","SPFG095L","Stupeň regulace cos fi - 0.95L - nastaveno","TS1234.NNO.VMS.S.SPFG095L",null,41234,161,18,5,120,6,229,0,"OK",5694840,86,229,120,30,"M_SP_TB_1",null,"VYPNUTO","ZAPNUTO"]
[null,"TS1234","NNO","VMS","S","SPFG090L","Stupeň regulace cos fi - 0.90L - nastaveno","TS1234.NNO.VMS.S.SPFG090L",null,41234,161,18,5,120,6,230,0,"OK",5695096,86,230,120,30,"M_SP_TB_1",null,"VYPNUTO","ZAPNUTO"]
[null,"TS1234","NNO","VM1","S","QM","Vypínač QM - stav","TS1234.NNO.VM1.S.QM",null,41234,161,18,5,121,0,1,0,"OK",5243257,80,1,121,31,"M_DP_TB_1",null,"MEZIPOLOHA","VYPNUTO","ZAPNUTO","PORUCHA"]
[null,"TS1234","NNO","VM1","P","H100T","Ochrany - působení ochran","TS1234.NNO.VM1.P.H100T",null,41234,161,18,5,121,1,1,0,"OK",5308793,81,1,121,30,"M_SP_TB_1",null,"KONEC","ZAČÁTEK"]
[null,"TS1234","NNO","VM1","P","H100IF","Ochrany - vnitřní porucha","TS1234.NNO.VM1.P.H100IF",null,41234,161,18,5,121,2,17,0,"OK",5378425,82,17,121,30,"M_SP_TB_1",null,"KONEC","ZAČÁTEK"]

{"sheet":"Příklad 1","index":1,"n_rows":38,"n_cols":32,"rows_kept":38,"cut":false,"hidden":false,"merged":[[3,25,3,29],[4,12,4,16],[4,22,4,23],[0,0,0,6],[1,0,1,6],[2,0,2,6],[3,1,3,6],[3,9,3,23]]}
["Seznam signálů SCADA - Výrobny"]
["Příklad 1"]
[]
[null,"Textová adresa (TA)",null,null,null,null,null,null,null,"IEC-60870-5-101",null,null,null,null,null,null,null,null,null,null,null,null,null,null,null,"Interpretace dat"]
["Příznak","Označení stanice PREdi","Napěťová hladina","Číslo pole","Typ signálu","Normované označení","Název signálu","Textová adresa",null,"ASDU Address","ASDU\nHigh Byte","ASDU\nLow Byte","Pomocné",null,null,null,null,{"$f":"\"Počet duplicit v IOA = \" &COUNTIF(R7:R40, \"DUPLICITA\")","v":"Počet duplicit v IOA = 0"},{"$f":"IF(COUNTIF(R7:R40, \"DUPLICITA\")>0,\"DUPLICITA\",\"Information Object Address\")","v":"Information Object Address"},"IOA\nHigh Byte","IOA\nMid Byte","IOA\nLow Byte","Datový typ",null,null,"0 / 00","1 / 01",10,11,"Jednotka",null,"Poznámka"]
["P","TA_STA","TA_NAP","TA_POLE","TA_TYP","TA_OZN","TA_Popis","TA_ADR","x","CAASDU_suma","CAASDU2","CAASDU1","A","B","C","D","E",{"$f":"\"IOA = \" &COUNTIF(R7:R40, \"DUPLICITA\")","v":"IOA = 0"},"IOA_suma","IOA3","IOA2","IOA1","TI_IEC","TI_OZN","x","LAB0","LAB1","LAB2","LAB3","UNIT","x","POZN"]
[null,"TS1234",22,4,"Z","QM","Vypínač QM - povel","TS1234.22.4.Z.QM",null,41234,161,18,3,4,10,1,0,"OK",3801348,58,1,4,46,"C_DC_NA_1",null,null,"VYPNOUT","ZAPNOUT"]
[null,"TS1234",22,4,"S","QM","Vypínač QM - stav","TS1234.22.4.S.QM",null,41234,161,18,3,4,0,1,0,"OK",3145988,48,1,4,31,"M_DP_TB_1",null,"MEZIPOLOHA","VYPNUTO","ZAPNUTO","PORUCHA"]
[null,"TS1234",22,4,"S","Q6","Odpojovač Q6 - stav","TS1234.22.4.S.Q6",null,41234,161,18,3,4,0,17,0,"OK",3150084,48,17,4,31,"M_DP_TB_1",null,"MEZIPOLOHA","VYPNUTO","ZAPNUTO","PORUCHA"]
[null,"TS1234",22,4,"S","QE6","Uzemňovač QE6 - stav","TS1234.22.4.S.QE6",null,41234,161,18,3,4,0,96,0,"OK",3170308,48,96,4,31,"M_DP_TB_1",null,"MEZIPOLOHA","VYPNUTO","ZAPNUTO","PORUCHA"]
[null,"TS1234",22,4,"M","UL1-L2","Měření sdruženého napětí L1-L2","TS1234.22.4.M.UL1-L2",null,41234,161,18,3,4,13,16,0,"OK",4001796,61,16,4,13,"M_ME_NC_1",null,null,null,null,null,"kV"]
[null,"TS1234",22,4,"M","IL2","Měření proudu IL2","TS1234.22.4.M.IL2",null,41234,161,18,3,4,13,2,0,"OK",3998212,61,2,4,13,"M_ME_NC_1",null,null,null,null,null,"A"]
[null,"TS1234",22,4,"M","P","Měření činného výkonu P","TS1234.22.4.M.P",null,41234,161,18,3,4,13,22,0,"OK",4003332,61,22,4,13,"M_ME_NC_1",null,null,null,null,null,"kW"]
[null,"TS1234",22,4,"M","Q","Měření jalového výkonu Q","TS1234.22.4.M.Q",null,41234,161,18,3,4,13,23,0,"OK",4003588,61,23,4,13,"M_ME_NC_1",null,null,null,null,null,"kvar"]
[null,"TS1234","NNO","VMS","Z","QM_TEST","Zkušební vypínač - povel","TS1234.NNO.VMS.Z.QM_TEST",null,41234,161,18,5,120,10,255,0,"OK",5963640,90,255,120,46,"C_DC_NA_1",null,null,"VYPNOUT","ZAPNOUT"]
[null,"TS1234","NNO","VMS","S","QM_TEST","Zkušební vypínač - stav","TS1234.NNO.VMS.S.QM_TEST",null,41234,161,18,5,120,0,255,0,"OK",5308280,80,255,120,31,"M_DP_TB_1",null,"MEZIPOLOHA","VYPNUTO","ZAPNUTO","PORUCHA"]
[null,"TS1234","NNO","VMS","P","H835L","Stejnosměrné napájení ovládání - ztráta napětí","TS1234.NNO.VMS.P.H835L",null,41234,161,18,5,120,7,128,0,"OK",5734520,87,128,120,30,"M_SP_TB_1",null,"KONEC","ZAČÁTEK"]
[null,"TS1234","NNO","VMS","Z","SPG100","Stupeň regulace P - výroba 100% - nastavit","TS1234.NNO.VMS.Z.SPG100",null,41234,161,18,5,120,12,81,0,"OK",6050168,92,81,120,45,"C_SC_NA_1",null,"VYPNOUT","ZAPNOUT"]
[null,"TS1234","NNO","VMS","Z","SPG060","Stupeň regulace P - výroba 60% - nastavit","TS1234.NNO.VMS.Z.SPG060",null,41234,161,18,5,120,12,82,0,"OK",6050424,92,82,120,45,"C_SC_NA_1",null,"VYPNOUT","ZAPNOUT"]
[null,"TS1234","NNO","VMS","Z","SPG030","Stupeň regulace P - výroba 30% - nastavit","TS1234.NNO.VMS.Z.SPG030",null,41234,161,18,5,120,12,83,0,"OK",6050680,92,83,120,45,"C_SC_NA_1",null,"VYPNOUT","ZAPNOUT"]
[null,"TS1234","NNO","VMS","Z","SPG000","Stupeň regulace P - výroba 0% - nastavit","TS1234.NNO.VMS.Z.SPG000",null,41234,161,18,5,120,12,84,0,"OK",6050936,92,84,120,45,"C_SC_NA_1",null,"VYPNOUT","ZAPNOUT"]
[null,"TS1234","NNO","VMS","S","SPG100","Stupeň regulace P - výroba 100% - nastaveno","TS1234.NNO.VMS.S.SPG100",null,41234,161,18,5,120,6,232,0,"OK",5695608,86,232,120,30,"M_SP_TB_1",null,"VYPNUTO","ZAPNUTO"]
[null,"TS1234","NNO","VMS","S","SPG060","Stupeň regulace P - výroba 60% - nastaveno","TS1234.NNO.VMS.S.SPG060",null,41234,161,18,5,120,6,233,0,"OK",5695864,86,233,120,30,"M_SP_TB_1",null,"VYPNUTO","ZAPNUTO"]
[null,"TS1234","NNO","VMS","S","SPG030","Stupeň regulace P - výroba 30% - nastaveno","TS1234.NNO.VMS.S.SPG030",null,41234,161,18,5,120,6,234,0,"OK",5696120,86,234,120,30,"M_SP_TB_1",null,"VYPNUTO","ZAPNUTO"]
[null,"TS1234","NNO","VMS","S","SPG000","Stupeň regulace P - výroba 0% - nastaveno","TS1234.NNO.VMS.S.SPG000",null,41234,161,18,5,120,6,235,0,"OK",5696376,86,235,120,30,"M_SP_TB_1",null,"VYPNUTO","ZAPNUTO"]
[null,"TS1234","NNO","VMS","Z","SPFG090C","Stupeň regulace cos fi - 0.90C - nastavit","TS1234.NNO.VMS.Z.SPFG090C",null,41234,161,18,5,120,12,127,0,"OK",6061944,92,127,120,45,"C_SC_NA_1",null,"VYPNOUT","ZAPNOUT"]
[null,"TS1234","NNO","VMS","Z","SPFG095C","Stupeň regulace cos fi - 0.95C - nastavit","TS1234.NNO.VMS.Z.SPFG095C",null,41234,161,18,5,120,12,128,0,"OK",6062200,92,128,120,45,"C_SC_NA_1",null,"VYPNOUT","ZAPNOUT"]
[null,"TS1234","NNO","VMS","Z","SPFG100","Stupeň regulace cos fi - 1.00 - nastavit","TS1234.NNO.VMS.Z.SPFG100",null,41234,161,18,5,120,12,129,0,"OK",6062456,92,129,120,45,"C_SC_NA_1",null,"VYPNOUT","ZAPNOUT"]
[null,"TS1234","NNO","VMS","Z","SPFG095L","Stupeň regulace cos fi - 0.95L - nastavit","TS1234.NNO.VMS.Z.SPFG095L",null,41234,161,18,5,120,12,130,0,"OK",6062712,92,130,120,45,"C_SC_NA_1",null,"VYPNOUT","ZAPNOUT"]
[null,"TS1234","NNO","VMS","Z","SPFG090L","Stupeň regulace cos fi - 0.90L - nastavit","TS1234.NNO.VMS.Z.SPFG090L",null,41234,161,18,5,120,12,131,0,"OK",6062968,92,131,120,45,"C_SC_NA_1",null,"VYPNOUT","ZAPNOUT"]
[null,"TS1234","NNO","VMS","S","SPFG090C","Stupeň regulace cos fi - 0.90C - nastaveno","TS1234.NNO.VMS.S.SPFG090C",null,41234,161,18,5,120,6,226,0,"OK",5694072,86,226,120,30,"M_SP_TB_1",null,"VYPNUTO","ZAPNUTO"]
[null,"TS1234","NNO","VMS","S","SPFG095C","Stupeň regulace cos fi - 0.95C - nastaveno","TS1234.NNO.VMS.S.SPFG095C",null,41234,161,18,5,120,6,227,0,"OK",5694328,86,227,120,30,"M_SP_TB_1",null,"VYPNUTO","ZAPNUTO"]
[null,"TS1234","NNO","VMS","S","SPFG100","Stupeň regulace cos fi - 1.00 - nastaveno","TS1234.NNO.VMS.S.SPFG100",null,41234,161,18,5,120,6,228,0,"OK",5694584,86,228,120,30,"M_SP_TB_1",null,"VYPNUTO","ZAPNUTO"]
[null,"TS1234","NNO","VMS","S","SPFG095L","Stupeň regulace cos fi - 0.95L - nastaveno","TS1234.NNO.VMS.S.SPFG095L",null,41234,161,18,5,120,6,229,0,"OK",5694840,86,229,120,30,"M_SP_TB_1",null,"VYPNUTO","ZAPNUTO"]
[null,"TS1234","NNO","VMS","S","SPFG090L","Stupeň regulace cos fi - 0.90L - nastaveno","TS1234.NNO.VMS.S.SPFG090L",null,41234,161,18,5,120,6,230,0,"OK",5695096,86,230,120,30,"M_SP_TB_1",null,"VYPNUTO","ZAPNUTO"]
[null,"TS1234","NNO","VM1","S","QM","Vypínač QM - stav","TS1234.NNO.VM1.S.QM",null,41234,161,18,5,121,0,1,0,"OK",5243257,80,1,121,31,"M_DP_TB_1",null,"MEZIPOLOHA","VYPNUTO","ZAPNUTO","PORUCHA"]
[null,"TS1234","NNO","VM1","P","H100T","Ochrany - působení ochran","TS1234.NNO.VM1.P.H100T",null,41234,161,18,5,121,1,1,0,"OK",5308793,81,1,121,30,"M_SP_TB_1",null,"KONEC","ZAČÁTEK"]
[null,"TS1234","NNO","VM1","P","H100IF","Ochrany - vnitřní porucha","1234.NNO.VM1.P.H100IF",null,41234,161,18,5,121,2,17,0,"OK",5378425,82,17,121,30,"M_SP_TB_1",null,"KONEC","ZAČÁTEK"]

{"sheet":"Příklad 2","index":2,"n_rows":39,"n_cols":32,"rows_kept":39,"cut":false,"hidden":false,"merged":[[3,25,3,29],[4,12,4,16],[4,22,4,23],[0,0,0,6],[1,0,1,6],[2,0,2,6],[3,1,3,6],[3,9,3,23]]}
["Seznam signálů SCADA - Výrobny"]
["Příklad 2"]
[]
[null,"Textová adresa (TA)",null,null,null,null,null,null,null,"IEC-60870-5-101",null,null,null,null,null,null,null,null,null,null,null,null,null,null,null,"Interpretace dat"]
["Příznak","Označení stanice PREdi","Napěťová hladina","Číslo pole","Typ signálu","Normované označení","Název signálu","Textová adresa",null,"ASDU Address","ASDU\nHigh Byte","ASDU\nLow Byte","Pomocné",null,null,null,null,{"$f":"\"Počet duplicit v IOA = \" &COUNTIF(R7:R41, \"DUPLICITA\")","v":"Počet duplicit v IOA = 0"},{"$f":"IF(COUNTIF(R7:R41, \"DUPLICITA\")>0,\"DUPLICITA\",\"Information Object Address\")","v":"Information Object Address"},"IOA\nHigh Byte","IOA\nMid Byte","IOA\nLow Byte","Datový typ",null,null,"0 / 00","1 / 01",10,11,"Jednotka",null,"Poznámka"]
["P","TA_STA","TA_NAP","TA_POLE","TA_TYP","TA_OZN","TA_Popis","TA_ADR","x","CAASDU_suma","CAASDU2","CAASDU1","A","B","C","D","E",{"$f":"\"IOA = \" &COUNTIF(R7:R41, \"DUPLICITA\")","v":"IOA = 0"},"IOA_suma","IOA3","IOA2","IOA1","TI_IEC","TI_OZN","x","LAB0","LAB1","LAB2","LAB3","UNIT","x","POZN"]
[null,"TS1234","NNO","VMS","Z","QM","Vypínač QM - povel","TS1234.NNO.VMS.Z.QM",null,41234,161,18,5,120,10,1,0,"OK",5898616,90,1,120,46,"C_DC_NA_1",null,null,"VYPNOUT","ZAPNOUT"]
[null,"TS1234","NNO","VMS","S","QM","Vypínač QM - stav","TS1234.NNO.VMS.S.QM",null,41234,161,18,5,120,0,1,0,"OK",5243256,80,1,120,31,"M_DP_TB_1",null,"MEZIPOLOHA","VYPNUTO","ZAPNUTO","PORUCHA"]
[null,"TS1234","NNO","VMS","M","UL2","Měření fázového napětí UL2","TS1234.NNO.VMS.M.UL2",null,41234,161,18,5,120,13,10,0,"OK",6097528,93,10,120,13,"M_ME_NC_1",null,null,null,null,null,"V"]
[null,"TS1234","NNO","VMS","M","IL2","Měření proudu IL2","TS1234.NNO.VMS.M.IL2",null,41234,161,18,5,120,13,2,0,"OK",6095480,93,2,120,13,"M_ME_NC_1",null,null,null,null,null,"A"]
[null,"TS1234","NNO","VMS","M","P","Měření činného výkonu P","TS1234.NNO.VMS.M.P",null,41234,161,18,5,120,13,22,0,"OK",6100600,93,22,120,13,"M_ME_NC_1",null,null,null,null,null,"kW"]
[null,"TS1234","NNO","VMS","M","Q","Měření jalového výkonu Q","TS1234.NNO.VMS.M.Q",null,41234,161,18,5,120,13,23,0,"OK",6100856,93,23,120,13,"M_ME_NC_1",null,null,null,null,null,"kvar"]
[null,"TS1234","NNO","VMS","Z","QM_TEST","Zkušební vypínač - povel","TS1234.NNO.VMS.Z.QM_TEST",null,41234,161,18,5,120,10,255,0,"OK",5963640,90,255,120,46,"C_DC_NA_1",null,null,"VYPNOUT","ZAPNOUT"]
[null,"TS1234","NNO","VMS","S","QM_TEST","Zkušební vypínač - stav","TS1234.NNO.VMS.S.QM_TEST",null,41234,161,18,5,120,0,255,0,"OK",5308280,80,255,120,31,"M_DP_TB_1",null,"MEZIPOLOHA","VYPNUTO","ZAPNUTO","PORUCHA"]
[null,"TS1234","NNO","VMS","P","H835L","Stejnosměrné napájení ovládání - ztráta napětí","TS1234.NNO.VMS.P.H835L",null,41234,161,18,5,120,7,128,0,"OK",5734520,87,128,120,30,"M_SP_TB_1",null,"KONEC","ZAČÁTEK"]
[null,"TS1234","NNO","VMS","Z","SPG100","Stupeň regulace P - výroba 100% - nastavit","TS1234.NNO.VMS.Z.SPG100",null,41234,161,18,5,120,12,81,0,"OK",6050168,92,81,120,45,"C_SC_NA_1",null,"VYPNOUT","ZAPNOUT"]
[null,"TS1234","NNO","VMS","Z","SPG060","Stupeň regulace P - výroba 60% - nastavit","TS1234.NNO.VMS.Z.SPG060",null,41234,161,18,5,120,12,82,0,"OK",6050424,92,82,120,45,"C_SC_NA_1",null,"VYPNOUT","ZAPNOUT"]
[null,"TS1234","NNO","VMS","Z","SPG030","Stupeň regulace P - výroba 30% - nastavit","TS1234.NNO.VMS.Z.SPG030",null,41234,161,18,5,120,12,83,0,"OK",6050680,92,83,120,45,"C_SC_NA_1",null,"VYPNOUT","ZAPNOUT"]
[null,"TS1234","NNO","VMS","Z","SPG000","Stupeň regulace P - výroba 0% - nastavit","TS1234.NNO.VMS.Z.SPG000",null,41234,161,18,5,120,12,84,0,"OK",6050936,92,84,120,45,"C_SC_NA_1",null,"VYPNOUT","ZAPNOUT"]
[null,"TS1234","NNO","VMS","S","SPG100","Stupeň regulace P - výroba 100% - nastaveno","TS1234.NNO.VMS.S.SPG100",null,41234,161,18,5,120,6,232,0,"OK",5695608,86,232,120,30,"M_SP_TB_1",null,"VYPNUTO","ZAPNUTO"]
[null,"TS1234","NNO","VMS","S","SPG060","Stupeň regulace P - výroba 60% - nastaveno","TS1234.NNO.VMS.S.SPG060",null,41234,161,18,5,120,6,233,0,"OK",5695864,86,233,120,30,"M_SP_TB_1",null,"VYPNUTO","ZAPNUTO"]
[null,"TS1234","NNO","VMS","S","SPG030","Stupeň regulace P - výroba 30% - nastaveno","TS1234.NNO.VMS.S.SPG030",null,41234,161,18,5,120,6,234,0,"OK",5696120,86,234,120,30,"M_SP_TB_1",null,"VYPNUTO","ZAPNUTO"]
[null,"TS1234","NNO","VMS","S","SPG000","Stupeň regulace P - výroba 0% - nastaveno","TS1234.NNO.VMS.S.SPG000",null,41234,161,18,5,120,6,235,0,"OK",5696376,86,235,120,30,"M_SP_TB_1",null,"VYPNUTO","ZAPNUTO"]
[null,"TS1234","NNO","VMS","Z","SPFG090C","Stupeň regulace cos fi - 0.90C - nastavit","TS1234.NNO.VMS.Z.SPFG090C",null,41234,161,18,5,120,12,127,0,"OK",6061944,92,127,120,45,"C_SC_NA_1",null,"VYPNOUT","ZAPNOUT"]
[null,"TS1234","NNO","VMS","Z","SPFG095C","Stupeň regulace cos fi - 0.95C - nastavit","TS1234.NNO.VMS.Z.SPFG095C",null,41234,161,18,5,120,12,128,0,"OK",6062200,92,128,120,45,"C_SC_NA_1",null,"VYPNOUT","ZAPNOUT"]
[null,"TS1234","NNO","VMS","Z","SPFG100","Stupeň regulace cos fi - 1.00 - nastavit","TS1234.NNO.VMS.Z.SPFG100",null,41234,161,18,5,120,12,129,0,"OK",6062456,92,129,120,45,"C_SC_NA_1",null,"VYPNOUT","ZAPNOUT"]
[null,"TS1234","NNO","VMS","Z","SPFG095L","Stupeň regulace cos fi - 0.95L - nastavit","TS1234.NNO.VMS.Z.SPFG095L",null,41234,161,18,5,120,12,130,0,"OK",6062712,92,130,120,45,"C_SC_NA_1",null,"VYPNOUT","ZAPNOUT"]
[null,"TS1234","NNO","VMS","Z","SPFG090L","Stupeň regulace cos fi - 0.90L - nastavit","TS1234.NNO.VMS.Z.SPFG090L",null,41234,161,18,5,120,12,131,0,"OK",6062968,92,131,120,45,"C_SC_NA_1",null,"VYPNOUT","ZAPNOUT"]
[null,"TS1234","NNO","VMS","S","SPFG090C","Stupeň regulace cos fi - 0.90C - nastaveno","TS1234.NNO.VMS.S.SPFG090C",null,41234,161,18,5,120,6,226,0,"OK",5694072,86,226,120,30,"M_SP_TB_1",null,"VYPNUTO","ZAPNUTO"]
[null,"TS1234","NNO","VMS","S","SPFG095C","Stupeň regulace cos fi - 0.95C - nastaveno","TS1234.NNO.VMS.S.SPFG095C",null,41234,161,18,5,120,6,227,0,"OK",5694328,86,227,120,30,"M_SP_TB_1",null,"VYPNUTO","ZAPNUTO"]
[null,"TS1234","NNO","VMS","S","SPFG100","Stupeň regulace cos fi - 1.00 - nastaveno","TS1234.NNO.VMS.S.SPFG100",null,41234,161,18,5,120,6,228,0,"OK",5694584,86,228,120,30,"M_SP_TB_1",null,"VYPNUTO","ZAPNUTO"]
[null,"TS1234","NNO","VMS","S","SPFG095L","Stupeň regulace cos fi - 0.95L - nastaveno","TS1234.NNO.VMS.S.SPFG095L",null,41234,161,18,5,120,6,229,0,"OK",5694840,86,229,120,30,"M_SP_TB_1",null,"VYPNUTO","ZAPNUTO"]
[null,"TS1234","NNO","VMS","S","SPFG090L","Stupeň regulace cos fi - 0.90L - nastaveno","TS1234.NNO.VMS.S.SPFG090L",null,41234,161,18,5,120,6,230,0,"OK",5695096,86,230,120,30,"M_SP_TB_1",null,"VYPNUTO","ZAPNUTO"]
[null,"TS1234","NNO","VM1","S","QM","Vypínač QM - stav","TS1234.NNO.VM1.S.QM",null,41234,161,18,5,121,0,1,0,"OK",5243257,80,1,121,31,"M_DP_TB_1",null,"MEZIPOLOHA","VYPNUTO","ZAPNUTO","PORUCHA"]
[null,"TS1234","NNO","VM1","P","H100T","Ochrany - působení ochran","TS1234.NNO.VM1.P.H100T",null,41234,161,18,5,121,1,1,0,"OK",5308793,81,1,121,30,"M_SP_TB_1",null,"KONEC","ZAČÁTEK"]
[null,"TS1234","NNO","VM1","P","H100IF","Ochrany - vnitřní porucha","TS1234.NNO.VM1.P.H100IF",null,41234,161,18,5,121,2,17,0,"OK",5378425,82,17,121,30,"M_SP_TB_1",null,"KONEC","ZAČÁTEK"]
[null,"TS1234","NNO","VM2","S","QM","Vypínač QM - stav","TS1234.NNO.VM2.S.QM",null,41234,161,18,5,122,0,1,0,"OK",5243258,80,1,122,31,"M_DP_TB_1",null,"MEZIPOLOHA","VYPNUTO","ZAPNUTO","PORUCHA"]
[null,"TS1234","NNO","VM2","P","H100T","Ochrany - působení ochran","TS1234.NNO.VM2.P.H100T",null,41234,161,18,5,122,1,1,0,"OK",5308794,81,1,122,30,"M_SP_TB_1",null,"KONEC","ZAČÁTEK"]
[null,"TS1234","NNO","VM2","P","H100IF","Ochrany - vnitřní porucha","TS1234.NNO.VM2.P.H100IF",null,41234,161,18,5,122,2,17,0,"OK",5378426,82,17,122,30,"M_SP_TB_1",null,"KONEC","ZAČÁTEK"]

{"sheet":"H298CEB","index":3,"n_rows":16,"n_cols":17,"rows_kept":16,"cut":false,"hidden":false,"merged":[]}
[null,"Zjednodušené logické schéma blokování zapnutí výrobny, v přípdě jednoho jistícího prvku pro oddělovací a rozpadové místo"]
[]
[null,"povel VYP z automatiky výrobny",null,null,null,null,null,null,null,null,null,null,"OR",null,null,null,"výstup VYP na vypínač (oddělovací místo)"]
[]
[]
[]
[]
[]
[null,"povel na blokování ZAP z ED PREdi (H298CEB)",null,null,null,null,null,null,"S","RS"]
[null,null,null,null,null,null,null,null,null,null,"Q",null,null,null,null,null,"signalizace blokování na ED PREdi (H298CEB)"]
[null,"povel na blokování VYP z ED PREdi (H298CEB)",null,null,null,null,null,null,"R"]
[]
[]
[null,null,null,null,null,null,null,null,null,null,null,null,"NOT",null,"AND"]
[null,null,null,null,null,null,null,null,null,null,null,null,"(negace)",null,null,null,"výstup ZAP na vypínač (oddělovací místo)"]
[null,"povel ZAP z automatiky výrobny"]

{"sheet":"Seznam signálů","index":4,"n_rows":59,"n_cols":32,"rows_kept":59,"cut":false,"hidden":false,"merged":[[3,25,3,29],[3,1,3,6],[3,9,3,23],[0,1,0,6],[1,1,1,6],[2,1,2,6],[4,12,4,16],[4,22,4,23]]}
["x","Seznam signálů SCADA - Výrobny"]
["x","TS 1234-VM"]
["x"]
[null,"Textová adresa (TA)",null,null,null,null,null,null,null,"IEC-60870-5-101",null,null,null,null,null,null,null,null,null,null,null,null,null,null,null,"Interpretace dat"]
["Příznak","Číslo stanice PREdi","Napěťová hladina","Číslo pole","Typ signálu","Normované označení","Název signálu","Textová adresa",null,"ASDU Address","ASDU\nHigh Byte","ASDU\nLow Byte","Pomocné",null,null,null,null,{"$f":"\"Počet duplicit v IOA = \" &COUNTIF(R7:R59, \"DUPLICITA\")","v":"Počet duplicit v IOA = 0"},{"$f":"IF(COUNTIF(R7:R59, \"DUPLICITA\")>0,\"DUPLICITA\",\"Information Object Address\")","v":"Information Object Address"},"IOA\nHigh Byte","IOA\nMid Byte","IOA\nLow Byte","Datový typ",null,null,"0 / 00","1 / 01",10,11,"Jednotka",null,"Poznámka"]
["P","TA_STA","TA_NAP","TA_POLE","TA_TYP","TA_OZN","TA_Popis","TA_ADR","x","CAASDU_suma","CAASDU2","CAASDU1","A","B","C","D","E",{"$f":"\"IOA = \" &COUNTIF(R7:R59, \"DUPLICITA\")","v":"IOA = 0"},"IOA_suma","IOA3","IOA2","IOA1","TI_IEC","TI_OZN","x","LAB0","LAB1","LAB2","LAB3","UNIT","x","POZN"]
[null,"TS1234","NNO","VMS","Z","QM",{"$f":"IF(F7<>\"\",VLOOKUP(E7&\"|\"&F7,'IO-KOD'!$A$1:$E$70,5,0),\"\")","v":"Vypínač QM - povel"},{"$f":"IF(F7<>\"\",SUBSTITUTE(B7&\".\"&C7&\".\"&D7&\".\"&E7&\".\"&F7,\" \",\"\"),\"\")","v":"TS1234.NNO.VMS.Z.QM"},null,{"$f":"IF(F7<>\"\",MID(B7,3,10)+40000,\"\")","v":41234},{"$f":"IF(J7<>\"\",INT(MOD(J7,65536)/256),\"\")","v":161},{"$f":"IF(J7<>\"\",MOD(J7,256),\"\")","v":18},{"$f":"IF(F7<>\"\",VLOOKUP(C7,Nap.hladiny!$A:$D,2,0),\"\")","v":5},{"$f":"IF(F7<>\"\",VLOOKUP(D7,Pole!$A:$B,2,0),\"\")","v":120},{"$f":"IF(F7<>\"\",VLOOKUP(E7&\"|\"&F7,'IO-KOD'!$A$1:$E$70,3,0),\"\")","v":10},{"$f":"IF(F7<>\"\",VLOOKUP(E7&\"|\"&F7,'IO-KOD'!$A$1:$E$70,4,0),\"\")","v":1},{"$f":"IF(F7<>\"\",VLOOKUP(C7,Nap.hladiny!$A:$D,3,0),\"\")","v":0},{"$f":"IF(F7<>\"\",IF(AND(COUNTIFS($S$7:$S$499, S7,$A$7:$A$499,\"<>N\")>1, S7<>\"\",A7<>\"N\"), \"DUPLICITA\", \"OK\"),\"\")","v":"OK"},{"$f":"IF(F7=\"\",\"\",(M7*2^20)+(O7*2^16)+(P7*2^8)+(Q7*2^7)+N7)","v":5898616},{"$f":"IF(S7<>\"\",(S7-(U7*256)-V7)/65536,\"\")","v":90},{"$f":"IF(S7<>\"\",INT(MOD(S7,65536)/256),\"\")","v":1},{"$f":"IF(S7<>\"\",MOD(S7,256),\"\")","v":120},{"$f":"IF(F7<>\"\",VLOOKUP(E7&\"|\"&F7,'IO-KOD'!$A$1:$H$70,8,0),\"\")","v":46},{"$f":"IF(W7<>\"\",VLOOKUP(W7,'104-TI'!$A:$B,2,0),\"\")","v":"C_DC_NA_1"},null,{"$f":"IF(F7<>\"\",VLOOKUP(E7&\"|\"&F7,'IO-KOD'!$A$1:$M$70,9,0),\"\")","v":"-"},{"$f":"IF(F7<>\"\",VLOOKUP(E7&\"|\"&F7,'IO-KOD'!$A$1:$M$70,10,0),\"\")","v":"VYPNOUT"},{"$f":"IF(F7<>\"\",VLOOKUP(E7&\"|\"&F7,'IO-KOD'!$A$1:$M$70,11,0),\"\")","v":"ZAPNOUT"},{"$f":"IF(F7<>\"\",VLOOKUP(E7&\"|\"&F7,'IO-KOD'!$A$1:$M$70,12,0),\"\")","v":"-"},{"$f":"IF(F7<>\"\",VLOOKUP(E7&\"|\"&F7,'IO-KOD'!$A$1:$M$70,13,0),\"\")","v":"-"}]
[null,"TS1234","NNO","VMS","S","QM",{"$f":"IF(F8<>\"\",VLOOKUP(E8&\"|\"&F8,'IO-KOD'!$A$1:$E$70,5,0),\"\")","v":"Vypínač QM - stav"},"TS1234.NNO.VMS.S.QM",null,{"$f":"IF(F8<>\"\",MID(B8,3,10)+40000,\"\")","v":41234},161,18,{"$f":"IF(F8<>\"\",VLOOKUP(C8,Nap.hladiny!$A:$D,2,0),\"\")","v":5},{"$f":"IF(F8<>\"\",VLOOKUP(D8,Pole!$A:$B,2,0),\"\")","v":120},{"$f":"IF(F8<>\"\",VLOOKUP(E8&\"|\"&F8,'IO-KOD'!$A$1:$E$70,3,0),\"\")","v":0},{"$f":"IF(F8<>\"\",VLOOKUP(E8&\"|\"&F8,'IO-KOD'!$A$1:$E$70,4,0),\"\")","v":1},{"$f":"IF(F8<>\"\",VLOOKUP(C8,Nap.hladiny!$A:$D,3,0),\"\")","v":0},"OK",{"$f":"IF(F8=\"\",\"\",(M8*2^20)+(O8*2^16)+(P8*2^8)+(Q8*2^7)+N8)","v":5243256},80,1,120,{"$f":"IF(F8<>\"\",VLOOKUP(E8&\"|\"&F8,'IO-KOD'!$A$1:$H$70,8,0),\"\")","v":31},{"$f":"IF(W8<>\"\",VLOOKUP(W8,'104-TI'!$A:$B,2,0),\"\")","v":"M_DP_TB_1"},null,{"$f":"IF(F8<>\"\",VLOOKUP(E8&\"|\"&F8,'IO-KOD'!$A$1:$M$70,9,0),\"\")","v":"MEZIPOLOHA"},{"$f":"IF(F8<>\"\",VLOOKUP(E8&\"|\"&F8,'IO-KOD'!$A$1:$M$70,10,0),\"\")","v":"VYPNUTO"},{"$f":"IF(F8<>\"\",VLOOKUP(E8&\"|\"&F8,'IO-KOD'!$A$1:$M$70,11,0),\"\")","v":"ZAPNUTO"},{"$f":"IF(F8<>\"\",VLOOKUP(E8&\"|\"&F8,'IO-KOD'!$A$1:$M$70,12,0),\"\")","v":"PORUCHA"},{"$f":"IF(F8<>\"\",VLOOKUP(E8&\"|\"&F8,'IO-KOD'!$A$1:$M$70,13,0),\"\")","v":"-"}]
[null,"TS1234","NNO","VMS","M","UL2",{"$f":"IF(F9<>\"\",VLOOKUP(E9&\"|\"&F9,'IO-KOD'!$A$1:$E$70,5,0),\"\")","v":"Měření fázového napětí UL2"},"TS1234.NNO.VMS.M.UL2",null,41234,161,18,{"$f":"IF(F9<>\"\",VLOOKUP(C9,Nap.hladiny!$A:$D,2,0),\"\")","v":5},{"$f":"IF(F9<>\"\",VLOOKUP(D9,Pole!$A:$B,2,0),\"\")","v":120},{"$f":"IF(F9<>\"\",VLOOKUP(E9&\"|\"&F9,'IO-KOD'!$A$1:$E$70,3,0),\"\")","v":13},{"$f":"IF(F9<>\"\",VLOOKUP(E9&\"|\"&F9,'IO-KOD'!$A$1:$E$70,4,0),\"\")","v":10},{"$f":"IF(F9<>\"\",VLOOKUP(C9,Nap.hladiny!$A:$D,3,0),\"\")","v":0},"OK",6097528,93,10,120,{"$f":"IF(F9<>\"\",VLOOKUP(E9&\"|\"&F9,'IO-KOD'!$A$1:$H$70,8,0),\"\")","v":13},{"$f":"IF(W9<>\"\",VLOOKUP(W9,'104-TI'!$A:$B,2,0),\"\")","v":"M_ME_NC_1"},null,{"$f":"IF(F9<>\"\",VLOOKUP(E9&\"|\"&F9,'IO-KOD'!$A$1:$M$70,9,0),\"\")","v":"-"},{"$f":"IF(F9<>\"\",VLOOKUP(E9&\"|\"&F9,'IO-KOD'!$A$1:$M$70,10,0),\"\")","v":"-"},{"$f":"IF(F9<>\"\",VLOOKUP(E9&\"|\"&F9,'IO-KOD'!$A$1:$M$70,11,0),\"\")","v":"-"},{"$f":"IF(F9<>\"\",VLOOKUP(E9&\"|\"&F9,'IO-KOD'!$A$1:$M$70,12,0),\"\")","v":"-"},{"$f":"IF(F9<>\"\",VLOOKUP(E9&\"|\"&F9,'IO-KOD'!$A$1:$M$70,13,0),\"\")","v":"V"}]
[null,"TS1234","NNO","VMS","M","IL2",{"$f":"IF(F10<>\"\",VLOOKUP(E10&\"|\"&F10,'IO-KOD'!$A$1:$E$70,5,0),\"\")","v":"Měření proudu IL2"},"TS1234.NNO.VMS.M.IL2",null,41234,161,18,{"$f":"IF(F10<>\"\",VLOOKUP(C10,Nap.hladiny!$A:$D,2,0),\"\")","v":5},{"$f":"IF(F10<>\"\",VLOOKUP(D10,Pole!$A:$B,2,0),\"\")","v":120},{"$f":"IF(F10<>\"\",VLOOKUP(E10&\"|\"&F10,'IO-KOD'!$A$1:$E$70,3,0),\"\")","v":13},{"$f":"IF(F10<>\"\",VLOOKUP(E10&\"|\"&F10,'IO-KOD'!$A$1:$E$70,4,0),\"\")","v":2},{"$f":"IF(F10<>\"\",VLOOKUP(C10,Nap.hladiny!$A:$D,3,0),\"\")","v":0},"OK",6095480,93,2,120,{"$f":"IF(F10<>\"\",VLOOKUP(E10&\"|\"&F10,'IO-KOD'!$A$1:$H$70,8,0),\"\")","v":13},{"$f":"IF(W10<>\"\",VLOOKUP(W10,'104-TI'!$A:$B,2,0),\"\")","v":"M_ME_NC_1"},null,{"$f":"IF(F10<>\"\",VLOOKUP(E10&\"|\"&F10,'IO-KOD'!$A$1:$M$70,9,0),\"\")","v":"-"},{"$f":"IF(F10<>\"\",VLOOKUP(E10&\"|\"&F10,'IO-KOD'!$A$1:$M$70,10,0),\"\")","v":"-"},{"$f":"IF(F10<>\"\",VLOOKUP(E10&\"|\"&F10,'IO-KOD'!$A$1:$M$70,11,0),\"\")","v":"-"},{"$f":"IF(F10<>\"\",VLOOKUP(E10&\"|\"&F10,'IO-KOD'!$A$1:$M$70,12,0),\"\")","v":"-"},{"$f":"IF(F10<>\"\",VLOOKUP(E10&\"|\"&F10,'IO-KOD'!$A$1:$M$70,13,0),\"\")","v":"A"}]
[null,"TS1234","NNO","VMS","M","P",{"$f":"IF(F11<>\"\",VLOOKUP(E11&\"|\"&F11,'IO-KOD'!$A$1:$E$70,5,0),\"\")","v":"Měření činného výkonu P"},"TS1234.NNO.VMS.M.P",null,41234,161,18,{"$f":"IF(F11<>\"\",VLOOKUP(C11,Nap.hladiny!$A:$D,2,0),\"\")","v":5},{"$f":"IF(F11<>\"\",VLOOKUP(D11,Pole!$A:$B,2,0),\"\")","v":120},{"$f":"IF(F11<>\"\",VLOOKUP(E11&\"|\"&F11,'IO-KOD'!$A$1:$E$70,3,0),\"\")","v":13},{"$f":"IF(F11<>\"\",VLOOKUP(E11&\"|\"&F11,'IO-KOD'!$A$1:$E$70,4,0),\"\")","v":22},{"$f":"IF(F11<>\"\",VLOOKUP(C11,Nap.hladiny!$A:$D,3,0),\"\")","v":0},"OK",6100600,93,22,120,{"$f":"IF(F11<>\"\",VLOOKUP(E11&\"|\"&F11,'IO-KOD'!$A$1:$H$70,8,0),\"\")","v":13},{"$f":"IF(W11<>\"\",VLOOKUP(W11,'104-TI'!$A:$B,2,0),\"\")","v":"M_ME_NC_1"},null,{"$f":"IF(F11<>\"\",VLOOKUP(E11&\"|\"&F11,'IO-KOD'!$A$1:$M$70,9,0),\"\")","v":"-"},{"$f":"IF(F11<>\"\",VLOOKUP(E11&\"|\"&F11,'IO-KOD'!$A$1:$M$70,10,0),\"\")","v":"-"},{"$f":"IF(F11<>\"\",VLOOKUP(E11&\"|\"&F11,'IO-KOD'!$A$1:$M$70,11,0),\"\")","v":"-"},{"$f":"IF(F11<>\"\",VLOOKUP(E11&\"|\"&F11,'IO-KOD'!$A$1:$M$70,12,0),\"\")","v":"-"},{"$f":"IF(F11<>\"\",VLOOKUP(E11&\"|\"&F11,'IO-KOD'!$A$1:$M$70,13,0),\"\")","v":"kW"}]
[null,"TS1234","NNO","VMS","M","Q",{"$f":"IF(F12<>\"\",VLOOKUP(E12&\"|\"&F12,'IO-KOD'!$A$1:$E$70,5,0),\"\")","v":"Měření jalového výkonu Q"},"TS1234.NNO.VMS.M.Q",null,41234,161,18,{"$f":"IF(F12<>\"\",VLOOKUP(C12,Nap.hladiny!$A:$D,2,0),\"\")","v":5},{"$f":"IF(F12<>\"\",VLOOKUP(D12,Pole!$A:$B,2,0),\"\")","v":120},{"$f":"IF(F12<>\"\",VLOOKUP(E12&\"|\"&F12,'IO-KOD'!$A$1:$E$70,3,0),\"\")","v":13},{"$f":"IF(F12<>\"\",VLOOKUP(E12&\"|\"&F12,'IO-KOD'!$A$1:$E$70,4,0),\"\")","v":23},{"$f":"IF(F12<>\"\",VLOOKUP(C12,Nap.hladiny!$A:$D,3,0),\"\")","v":0},"OK",6100856,93,23,120,{"$f":"IF(F12<>\"\",VLOOKUP(E12&\"|\"&F12,'IO-KOD'!$A$1:$H$70,8,0),\"\")","v":13},{"$f":"IF(W12<>\"\",VLOOKUP(W12,'104-TI'!$A:$B,2,0),\"\")","v":"M_ME_NC_1"},null,{"$f":"IF(F12<>\"\",VLOOKUP(E12&\"|\"&F12,'IO-KOD'!$A$1:$M$70,9,0),\"\")","v":"-"},{"$f":"IF(F12<>\"\",VLOOKUP(E12&\"|\"&F12,'IO-KOD'!$A$1:$M$70,10,0),\"\")","v":"-"},{"$f":"IF(F12<>\"\",VLOOKUP(E12&\"|\"&F12,'IO-KOD'!$A$1:$M$70,11,0),\"\")","v":"-"},{"$f":"IF(F12<>\"\",VLOOKUP(E12&\"|\"&F12,'IO-KOD'!$A$1:$M$70,12,0),\"\")","v":"-"},{"$f":"IF(F12<>\"\",VLOOKUP(E12&\"|\"&F12,'IO-KOD'!$A$1:$M$70,13,0),\"\")","v":"kvar"}]
[null,"TS1234","NNO","VMS","Z","QM_TEST",{"$f":"IF(F13<>\"\",VLOOKUP(E13&\"|\"&F13,'IO-KOD'!$A$1:$E$70,5,0),\"\")","v":"Zkušební vypínač - povel"},"TS1234.NNO.VMS.Z.QM_TEST",null,41234,161,18,{"$f":"IF(F13<>\"\",VLOOKUP(C13,Nap.hladiny!$A:$D,2,0),\"\")","v":5},{"$f":"IF(F13<>\"\",VLOOKUP(D13,Pole!$A:$B,2,0),\"\")","v":120},{"$f":"IF(F13<>\"\",VLOOKUP(E13&\"|\"&F13,'IO-KOD'!$A$1:$E$70,3,0),\"\")","v":10},{"$f":"IF(F13<>\"\",VLOOKUP(E13&\"|\"&F13,'IO-KOD'!$A$1:$E$70,4,0),\"\")","v":255},{"$f":"IF(F13<>\"\",VLOOKUP(C13,Nap.hladiny!$A:$D,3,0),\"\")","v":0},"OK",5963640,90,255,120,{"$f":"IF(F13<>\"\",VLOOKUP(E13&\"|\"&F13,'IO-KOD'!$A$1:$H$70,8,0),\"\")","v":46},{"$f":"IF(W13<>\"\",VLOOKUP(W13,'104-TI'!$A:$B,2,0),\"\")","v":"C_DC_NA_1"},null,{"$f":"IF(F13<>\"\",VLOOKUP(E13&\"|\"&F13,'IO-KOD'!$A$1:$M$70,9,0),\"\")","v":"-"},{"$f":"IF(F13<>\"\",VLOOKUP(E13&\"|\"&F13,'IO-KOD'!$A$1:$M$70,10,0),\"\")","v":"VYPNOUT"},{"$f":"IF(F13<>\"\",VLOOKUP(E13&\"|\"&F13,'IO-KOD'!$A$1:$M$70,11,0),\"\")","v":"ZAPNOUT"},{"$f":"IF(F13<>\"\",VLOOKUP(E13&\"|\"&F13,'IO-KOD'!$A$1:$M$70,12,0),\"\")","v":"-"},{"$f":"IF(F13<>\"\",VLOOKUP(E13&\"|\"&F13,'IO-KOD'!$A$1:$M$70,13,0),\"\")","v":"-"}]
[null,"TS1234","NNO","VMS","S","QM_TEST",{"$f":"IF(F14<>\"\",VLOOKUP(E14&\"|\"&F14,'IO-KOD'!$A$1:$E$70,5,0),\"\")","v":"Zkušební vypínač - stav"},"TS1234.NNO.VMS.S.QM_TEST",null,41234,161,{"$f":"IF(J14<>\"\",MOD(J14,256),\"\")","v":18},{"$f":"IF(F14<>\"\",VLOOKUP(C14,Nap.hladiny!$A:$D,2,0),\"\")","v":5},{"$f":"IF(F14<>\"\",VLOOKUP(D14,Pole!$A:$B,2,0),\"\")","v":120},{"$f":"IF(F14<>\"\",VLOOKUP(E14&\"|\"&F14,'IO-KOD'!$A$1:$E$70,3,0),\"\")","v":0},{"$f":"IF(F14<>\"\",VLOOKUP(E14&\"|\"&F14,'IO-KOD'!$A$1:$E$70,4,0),\"\")","v":255},{"$f":"IF(F14<>\"\",VLOOKUP(C14,Nap.hladiny!$A:$D,3,0),\"\")","v":0},"OK",5308280,80,255,120,{"$f":"IF(F14<>\"\",VLOOKUP(E14&\"|\"&F14,'IO-KOD'!$A$1:$H$70,8,0),\"\")","v":31},{"$f":"IF(W14<>\"\",VLOOKUP(W14,'104-TI'!$A:$B,2,0),\"\")","v":"M_DP_TB_1"},null,{"$f":"IF(F14<>\"\",VLOOKUP(E14&\"|\"&F14,'IO-KOD'!$A$1:$M$70,9,0),\"\")","v":"MEZIPOLOHA"},{"$f":"IF(F14<>\"\",VLOOKUP(E14&\"|\"&F14,'IO-KOD'!$A$1:$M$70,10,0),\"\")","v":"VYPNUTO"},{"$f":"IF(F14<>\"\",VLOOKUP(E14&\"|\"&F14,'IO-KOD'!$A$1:$M$70,11,0),\"\")","v":"ZAPNUTO"},{"$f":"IF(F14<>\"\",VLOOKUP(E14&\"|\"&F14,'IO-KOD'!$A$1:$M$70,12,0),\"\")","v":"PORUCHA"},{"$f":"IF(F14<>\"\",VLOOKUP(E14&\"|\"&F14,'IO-KOD'!$A$1:$M$70,13,0),\"\")","v":"-"}]
[null,"TS1234","NNO","VMS","P","H835L",{"$f":"IF(F15<>\"\",VLOOKUP(E15&\"|\"&F15,'IO-KOD'!$A$1:$E$70,5,0),\"\")","v":"Stejnosměrné napájení ovládání - ztráta napětí"},"TS1234.NNO.VMS.P.H835L",null,41234,161,18,{"$f":"IF(F15<>\"\",VLOOKUP(C15,Nap.hladiny!$A:$D,2,0),\"\")","v":5},{"$f":"IF(F15<>\"\",VLOOKUP(D15,Pole!$A:$B,2,0),\"\")","v":120},{"$f":"IF(F15<>\"\",VLOOKUP(E15&\"|\"&F15,'IO-KOD'!$A$1:$E$70,3,0),\"\")","v":7},{"$f":"IF(F15<>\"\",VLOOKUP(E15&\"|\"&F15,'IO-KOD'!$A$1:$E$70,4,0),\"\")","v":128},{"$f":"IF(F15<>\"\",VLOOKUP(C15,Nap.hladiny!$A:$D,3,0),\"\")","v":0},"OK",5734520,87,128,120,{"$f":"IF(F15<>\"\",VLOOKUP(E15&\"|\"&F15,'IO-KOD'!$A$1:$H$70,8,0),\"\")","v":30},{"$f":"IF(W15<>\"\",VLOOKUP(W15,'104-TI'!$A:$B,2,0),\"\")","v":"M_SP_TB_1"},null,{"$f":"IF(F15<>\"\",VLOOKUP(E15&\"|\"&F15,'IO-KOD'!$A$1:$M$70,9,0),\"\")","v":"KONEC"},{"$f":"IF(F15<>\"\",VLOOKUP(E15&\"|\"&F15,'IO-KOD'!$A$1:$M$70,10,0),\"\")","v":"ZAČÁTEK"},{"$f":"IF(F15<>\"\",VLOOKUP(E15&\"|\"&F15,'IO-KOD'!$A$1:$M$70,11,0),\"\")","v":"-"},{"$f":"IF(F15<>\"\",VLOOKUP(E15&\"|\"&F15,'IO-KOD'!$A$1:$M$70,12,0),\"\")","v":"-"},{"$f":"IF(F15<>\"\",VLOOKUP(E15&\"|\"&F15,'IO-KOD'!$A$1:$M$70,13,0),\"\")","v":"-"}]
[null,"TS1234","NNO","VMS","Z","SPG100",{"$f":"IF(F16<>\"\",VLOOKUP(E16&\"|\"&F16,'IO-KOD'!$A$1:$E$70,5,0),\"\")","v":"Stupeň regulace P - výroba 100% - nastavit"},"TS1234.NNO.VMS.Z.SPG100",null,41234,161,18,{"$f":"IF(F16<>\"\",VLOOKUP(C16,Nap.hladiny!$A:$D,2,0),\"\")","v":5},{"$f":"IF(F16<>\"\",VLOOKUP(D16,Pole!$A:$B,2,0),\"\")","v":120},{"$f":"IF(F16<>\"\",VLOOKUP(E16&\"|\"&F16,'IO-KOD'!$A$1:$E$70,3,0),\"\")","v":12},{"$f":"IF(F16<>\"\",VLOOKUP(E16&\"|\"&F16,'IO-KOD'!$A$1:$E$70,4,0),\"\")","v":81},{"$f":"IF(F16<>\"\",VLOOKUP(C16,Nap.hladiny!$A:$D,3,0),\"\")","v":0},"OK",6050168,92,81,120,{"$f":"IF(F16<>\"\",VLOOKUP(E16&\"|\"&F16,'IO-KOD'!$A$1:$H$70,8,0),\"\")","v":45},{"$f":"IF(W16<>\"\",VLOOKUP(W16,'104-TI'!$A:$B,2,0),\"\")","v":"C_SC_NA_1"},null,{"$f":"IF(F16<>\"\",VLOOKUP(E16&\"|\"&F16,'IO-KOD'!$A$1:$M$70,9,0),\"\")","v":"VYPNOUT"},{"$f":"IF(F16<>\"\",VLOOKUP(E16&\"|\"&F16,'IO-KOD'!$A$1:$M$70,10,0),\"\")","v":"ZAPNOUT"},{"$f":"IF(F16<>\"\",VLOOKUP(E16&\"|\"&F16,'IO-KOD'!$A$1:$M$70,11,0),\"\")","v":"-"},{"$f":"IF(F16<>\"\",VLOOKUP(E16&\"|\"&F16,'IO-KOD'!$A$1:$M$70,12,0),\"\")","v":"-"},{"$f":"IF(F16<>\"\",VLOOKUP(E16&\"|\"&F16,'IO-KOD'!$A$1:$M$70,13,0),\"\")","v":"-"}]
[null,"TS1234","NNO","VMS","Z","SPG060",{"$f":"IF(F17<>\"\",VLOOKUP(E17&\"|\"&F17,'IO-KOD'!$A$1:$E$70,5,0),\"\")","v":"Stupeň regulace P - výroba 60% - nastavit"},"TS1234.NNO.VMS.Z.SPG060",null,41234,161,18,{"$f":"IF(F17<>\"\",VLOOKUP(C17,Nap.hladiny!$A:$D,2,0),\"\")","v":5},{"$f":"IF(F17<>\"\",VLOOKUP(D17,Pole!$A:$B,2,0),\"\")","v":120},{"$f":"IF(F17<>\"\",VLOOKUP(E17&\"|\"&F17,'IO-KOD'!$A$1:$E$70,3,0),\"\")","v":12},{"$f":"IF(F17<>\"\",VLOOKUP(E17&\"|\"&F17,'IO-KOD'!$A$1:$E$70,4,0),\"\")","v":82},{"$f":"IF(F17<>\"\",VLOOKUP(C17,Nap.hladiny!$A:$D,3,0),\"\")","v":0},"OK",6050424,92,82,120,{"$f":"IF(F17<>\"\",VLOOKUP(E17&\"|\"&F17,'IO-KOD'!$A$1:$H$70,8,0),\"\")","v":45},{"$f":"IF(W17<>\"\",VLOOKUP(W17,'104-TI'!$A:$B,2,0),\"\")","v":"C_SC_NA_1"},null,{"$f":"IF(F17<>\"\",VLOOKUP(E17&\"|\"&F17,'IO-KOD'!$A$1:$M$70,9,0),\"\")","v":"VYPNOUT"},{"$f":"IF(F17<>\"\",VLOOKUP(E17&\"|\"&F17,'IO-KOD'!$A$1:$M$70,10,0),\"\")","v":"ZAPNOUT"},{"$f":"IF(F17<>\"\",VLOOKUP(E17&\"|\"&F17,'IO-KOD'!$A$1:$M$70,11,0),\"\")","v":"-"},{"$f":"IF(F17<>\"\",VLOOKUP(E17&\"|\"&F17,'IO-KOD'!$A$1:$M$70,12,0),\"\")","v":"-"},{"$f":"IF(F17<>\"\",VLOOKUP(E17&\"|\"&F17,'IO-KOD'!$A$1:$M$70,13,0),\"\")","v":"-"}]
[null,"TS1234","NNO","VMS","Z","SPG030",{"$f":"IF(F18<>\"\",VLOOKUP(E18&\"|\"&F18,'IO-KOD'!$A$1:$E$70,5,0),\"\")","v":"Stupeň regulace P - výroba 30% - nastavit"},"TS1234.NNO.VMS.Z.SPG030",null,41234,161,18,{"$f":"IF(F18<>\"\",VLOOKUP(C18,Nap.hladiny!$A:$D,2,0),\"\")","v":5},{"$f":"IF(F18<>\"\",VLOOKUP(D18,Pole!$A:$B,2,0),\"\")","v":120},{"$f":"IF(F18<>\"\",VLOOKUP(E18&\"|\"&F18,'IO-KOD'!$A$1:$E$70,3,0),\"\")","v":12},{"$f":"IF(F18<>\"\",VLOOKUP(E18&\"|\"&F18,'IO-KOD'!$A$1:$E$70,4,0),\"\")","v":83},{"$f":"IF(F18<>\"\",VLOOKUP(C18,Nap.hladiny!$A:$D,3,0),\"\")","v":0},"OK",6050680,92,83,120,{"$f":"IF(F18<>\"\",VLOOKUP(E18&\"|\"&F18,'IO-KOD'!$A$1:$H$70,8,0),\"\")","v":45},{"$f":"IF(W18<>\"\",VLOOKUP(W18,'104-TI'!$A:$B,2,0),\"\")","v":"C_SC_NA_1"},null,{"$f":"IF(F18<>\"\",VLOOKUP(E18&\"|\"&F18,'IO-KOD'!$A$1:$M$70,9,0),\"\")","v":"VYPNOUT"},{"$f":"IF(F18<>\"\",VLOOKUP(E18&\"|\"&F18,'IO-KOD'!$A$1:$M$70,10,0),\"\")","v":"ZAPNOUT"},{"$f":"IF(F18<>\"\",VLOOKUP(E18&\"|\"&F18,'IO-KOD'!$A$1:$M$70,11,0),\"\")","v":"-"},{"$f":"IF(F18<>\"\",VLOOKUP(E18&\"|\"&F18,'IO-KOD'!$A$1:$M$70,12,0),\"\")","v":"-"},{"$f":"IF(F18<>\"\",VLOOKUP(E18&\"|\"&F18,'IO-KOD'!$A$1:$M$70,13,0),\"\")","v":"-"}]
[null,"TS1234","NNO","VMS","Z","SPG000",{"$f":"IF(F19<>\"\",VLOOKUP(E19&\"|\"&F19,'IO-KOD'!$A$1:$E$70,5,0),\"\")","v":"Stupeň regulace P - výroba 0% - nastavit"},"TS1234.NNO.VMS.Z.SPG000",null,41234,161,18,{"$f":"IF(F19<>\"\",VLOOKUP(C19,Nap.hladiny!$A:$D,2,0),\"\")","v":5},{"$f":"IF(F19<>\"\",VLOOKUP(D19,Pole!$A:$B,2,0),\"\")","v":120},{"$f":"IF(F19<>\"\",VLOOKUP(E19&\"|\"&F19,'IO-KOD'!$A$1:$E$70,3,0),\"\")","v":12},{"$f":"IF(F19<>\"\",VLOOKUP(E19&\"|\"&F19,'IO-KOD'!$A$1:$E$70,4,0),\"\")","v":84},{"$f":"IF(F19<>\"\",VLOOKUP(C19,Nap.hladiny!$A:$D,3,0),\"\")","v":0},"OK",6050936,92,84,120,{"$f":"IF(F19<>\"\",VLOOKUP(E19&\"|\"&F19,'IO-KOD'!$A$1:$H$70,8,0),\"\")","v":45},{"$f":"IF(W19<>\"\",VLOOKUP(W19,'104-TI'!$A:$B,2,0),\"\")","v":"C_SC_NA_1"},null,{"$f":"IF(F19<>\"\",VLOOKUP(E19&\"|\"&F19,'IO-KOD'!$A$1:$M$70,9,0),\"\")","v":"VYPNOUT"},{"$f":"IF(F19<>\"\",VLOOKUP(E19&\"|\"&F19,'IO-KOD'!$A$1:$M$70,10,0),\"\")","v":"ZAPNOUT"},{"$f":"IF(F19<>\"\",VLOOKUP(E19&\"|\"&F19,'IO-KOD'!$A$1:$M$70,11,0),\"\")","v":"-"},{"$f":"IF(F19<>\"\",VLOOKUP(E19&\"|\"&F19,'IO-KOD'!$A$1:$M$70,12,0),\"\")","v":"-"},{"$f":"IF(F19<>\"\",VLOOKUP(E19&\"|\"&F19,'IO-KOD'!$A$1:$M$70,13,0),\"\")","v":"-"}]
[null,"TS1234","NNO","VMS","S","SPG100",{"$f":"IF(F20<>\"\",VLOOKUP(E20&\"|\"&F20,'IO-KOD'!$A$1:$E$70,5,0),\"\")","v":"Stupeň regulace P - výroba 100% - nastaveno"},"TS1234.NNO.VMS.S.SPG100",null,41234,161,18,{"$f":"IF(F20<>\"\",VLOOKUP(C20,Nap.hladiny!$A:$D,2,0),\"\")","v":5},{"$f":"IF(F20<>\"\",VLOOKUP(D20,Pole!$A:$B,2,0),\"\")","v":120},{"$f":"IF(F20<>\"\",VLOOKUP(E20&\"|\"&F20,'IO-KOD'!$A$1:$E$70,3,0),\"\")","v":6},{"$f":"IF(F20<>\"\",VLOOKUP(E20&\"|\"&F20,'IO-KOD'!$A$1:$E$70,4,0),\"\")","v":232},{"$f":"IF(F20<>\"\",VLOOKUP(C20,Nap.hladiny!$A:$D,3,0),\"\")","v":0},"OK",5695608,86,232,120,{"$f":"IF(F20<>\"\",VLOOKUP(E20&\"|\"&F20,'IO-KOD'!$A$1:$H$70,8,0),\"\")","v":30},{"$f":"IF(W20<>\"\",VLOOKUP(W20,'104-TI'!$A:$B,2,0),\"\")","v":"M_SP_TB_1"},null,{"$f":"IF(F20<>\"\",VLOOKUP(E20&\"|\"&F20,'IO-KOD'!$A$1:$M$70,9,0),\"\")","v":"VYPNUTO"},{"$f":"IF(F20<>\"\",VLOOKUP(E20&\"|\"&F20,'IO-KOD'!$A$1:$M$70,10,0),\"\")","v":"ZAPNUTO"},{"$f":"IF(F20<>\"\",VLOOKUP(E20&\"|\"&F20,'IO-KOD'!$A$1:$M$70,11,0),\"\")","v":"-"},{"$f":"IF(F20<>\"\",VLOOKUP(E20&\"|\"&F20,'IO-KOD'!$A$1:$M$70,12,0),\"\")","v":"-"},{"$f":"IF(F20<>\"\",VLOOKUP(E20&\"|\"&F20,'IO-KOD'!$A$1:$M$70,13,0),\"\")","v":"-"}]
[null,"TS1234","NNO","VMS","S","SPG060",{"$f":"IF(F21<>\"\",VLOOKUP(E21&\"|\"&F21,'IO-KOD'!$A$1:$E$70,5,0),\"\")","v":"Stupeň regulace P - výroba 60% - nastaveno"},"TS1234.NNO.VMS.S.SPG060",null,41234,161,18,{"$f":"IF(F21<>\"\",VLOOKUP(C21,Nap.hladiny!$A:$D,2,0),\"\")","v":5},{"$f":"IF(F21<>\"\",VLOOKUP(D21,Pole!$A:$B,2,0),\"\")","v":120},{"$f":"IF(F21<>\"\",VLOOKUP(E21&\"|\"&F21,'IO-KOD'!$A$1:$E$70,3,0),\"\")","v":6},{"$f":"IF(F21<>\"\",VLOOKUP(E21&\"|\"&F21,'IO-KOD'!$A$1:$E$70,4,0),\"\")","v":233},{"$f":"IF(F21<>\"\",VLOOKUP(C21,Nap.hladiny!$A:$D,3,0),\"\")","v":0},"OK",5695864,86,233,120,{"$f":"IF(F21<>\"\",VLOOKUP(E21&\"|\"&F21,'IO-KOD'!$A$1:$H$70,8,0),\"\")","v":30},{"$f":"IF(W21<>\"\",VLOOKUP(W21,'104-TI'!$A:$B,2,0),\"\")","v":"M_SP_TB_1"},null,{"$f":"IF(F21<>\"\",VLOOKUP(E21&\"|\"&F21,'IO-KOD'!$A$1:$M$70,9,0),\"\")","v":"VYPNUTO"},{"$f":"IF(F21<>\"\",VLOOKUP(E21&\"|\"&F21,'IO-KOD'!$A$1:$M$70,10,0),\"\")","v":"ZAPNUTO"},{"$f":"IF(F21<>\"\",VLOOKUP(E21&\"|\"&F21,'IO-KOD'!$A$1:$M$70,11,0),\"\")","v":"-"},{"$f":"IF(F21<>\"\",VLOOKUP(E21&\"|\"&F21,'IO-KOD'!$A$1:$M$70,12,0),\"\")","v":"-"},{"$f":"IF(F21<>\"\",VLOOKUP(E21&\"|\"&F21,'IO-KOD'!$A$1:$M$70,13,0),\"\")","v":"-"}]
[null,"TS1234","NNO","VMS","S","SPG030",{"$f":"IF(F22<>\"\",VLOOKUP(E22&\"|\"&F22,'IO-KOD'!$A$1:$E$70,5,0),\"\")","v":"Stupeň regulace P - výroba 30% - nastaveno"},"TS1234.NNO.VMS.S.SPG030",null,41234,161,18,{"$f":"IF(F22<>\"\",VLOOKUP(C22,Nap.hladiny!$A:$D,2,0),\"\")","v":5},{"$f":"IF(F22<>\"\",VLOOKUP(D22,Pole!$A:$B,2,0),\"\")","v":120},{"$f":"IF(F22<>\"\",VLOOKUP(E22&\"|\"&F22,'IO-KOD'!$A$1:$E$70,3,0),\"\")","v":6},{"$f":"IF(F22<>\"\",VLOOKUP(E22&\"|\"&F22,'IO-KOD'!$A$1:$E$70,4,0),\"\")","v":234},{"$f":"IF(F22<>\"\",VLOOKUP(C22,Nap.hladiny!$A:$D,3,0),\"\")","v":0},"OK",5696120,86,234,120,{"$f":"IF(F22<>\"\",VLOOKUP(E22&\"|\"&F22,'IO-KOD'!$A$1:$H$70,8,0),\"\")","v":30},{"$f":"IF(W22<>\"\",VLOOKUP(W22,'104-TI'!$A:$B,2,0),\"\")","v":"M_SP_TB_1"},null,{"$f":"IF(F22<>\"\",VLOOKUP(E22&\"|\"&F22,'IO-KOD'!$A$1:$M$70,9,0),\"\")","v":"VYPNUTO"},{"$f":"IF(F22<>\"\",VLOOKUP(E22&\"|\"&F22,'IO-KOD'!$A$1:$M$70,10,0),\"\")","v":"ZAPNUTO"},{"$f":"IF(F22<>\"\",VLOOKUP(E22&\"|\"&F22,'IO-KOD'!$A$1:$M$70,11,0),\"\")","v":"-"},{"$f":"IF(F22<>\"\",VLOOKUP(E22&\"|\"&F22,'IO-KOD'!$A$1:$M$70,12,0),\"\")","v":"-"},{"$f":"IF(F22<>\"\",VLOOKUP(E22&\"|\"&F22,'IO-KOD'!$A$1:$M$70,13,0),\"\")","v":"-"}]
[null,"TS1234","NNO","VMS","S","SPG000",{"$f":"IF(F23<>\"\",VLOOKUP(E23&\"|\"&F23,'IO-KOD'!$A$1:$E$70,5,0),\"\")","v":"Stupeň regulace P - výroba 0% - nastaveno"},"TS1234.NNO.VMS.S.SPG000",null,41234,161,18,{"$f":"IF(F23<>\"\",VLOOKUP(C23,Nap.hladiny!$A:$D,2,0),\"\")","v":5},{"$f":"IF(F23<>\"\",VLOOKUP(D23,Pole!$A:$B,2,0),\"\")","v":120},{"$f":"IF(F23<>\"\",VLOOKUP(E23&\"|\"&F23,'IO-KOD'!$A$1:$E$70,3,0),\"\")","v":6},{"$f":"IF(F23<>\"\",VLOOKUP(E23&\"|\"&F23,'IO-KOD'!$A$1:$E$70,4,0),\"\")","v":235},{"$f":"IF(F23<>\"\",VLOOKUP(C23,Nap.hladiny!$A:$D,3,0),\"\")","v":0},"OK",5696376,86,235,120,{"$f":"IF(F23<>\"\",VLOOKUP(E23&\"|\"&F23,'IO-KOD'!$A$1:$H$70,8,0),\"\")","v":30},{"$f":"IF(W23<>\"\",VLOOKUP(W23,'104-TI'!$A:$B,2,0),\"\")","v":"M_SP_TB_1"},null,{"$f":"IF(F23<>\"\",VLOOKUP(E23&\"|\"&F23,'IO-KOD'!$A$1:$M$70,9,0),\"\")","v":"VYPNUTO"},{"$f":"IF(F23<>\"\",VLOOKUP(E23&\"|\"&F23,'IO-KOD'!$A$1:$M$70,10,0),\"\")","v":"ZAPNUTO"},{"$f":"IF(F23<>\"\",VLOOKUP(E23&\"|\"&F23,'IO-KOD'!$A$1:$M$70,11,0),\"\")","v":"-"},{"$f":"IF(F23<>\"\",VLOOKUP(E23&\"|\"&F23,'IO-KOD'!$A$1:$M$70,12,0),\"\")","v":"-"},{"$f":"IF(F23<>\"\",VLOOKUP(E23&\"|\"&F23,'IO-KOD'!$A$1:$M$70,13,0),\"\")","v":"-"}]
[null,"TS1234","NNO","VMS","Z","SPFG090C",{"$f":"IF(F24<>\"\",VLOOKUP(E24&\"|\"&F24,'IO-KOD'!$A$1:$E$70,5,0),\"\")","v":"Stupeň regulace cos fi - 0.90C - nastavit"},"TS1234.NNO.VMS.Z.SPFG090C",null,41234,161,18,{"$f":"IF(F24<>\"\",VLOOKUP(C24,Nap.hladiny!$A:$D,2,0),\"\")","v":5},{"$f":"IF(F24<>\"\",VLOOKUP(D24,Pole!$A:$B,2,0),\"\")","v":120},{"$f":"IF(F24<>\"\",VLOOKUP(E24&\"|\"&F24,'IO-KOD'!$A$1:$E$70,3,0),\"\")","v":12},{"$f":"IF(F24<>\"\",VLOOKUP(E24&\"|\"&F24,'IO-KOD'!$A$1:$E$70,4,0),\"\")","v":127},{"$f":"IF(F24<>\"\",VLOOKUP(C24,Nap.hladiny!$A:$D,3,0),\"\")","v":0},"OK",6061944,92,127,120,{"$f":"IF(F24<>\"\",VLOOKUP(E24&\"|\"&F24,'IO-KOD'!$A$1:$H$70,8,0),\"\")","v":45},{"$f":"IF(W24<>\"\",VLOOKUP(W24,'104-TI'!$A:$B,2,0),\"\")","v":"C_SC_NA_1"},null,{"$f":"IF(F24<>\"\",VLOOKUP(E24&\"|\"&F24,'IO-KOD'!$A$1:$M$70,9,0),\"\")","v":"VYPNOUT"},{"$f":"IF(F24<>\"\",VLOOKUP(E24&\"|\"&F24,'IO-KOD'!$A$1:$M$70,10,0),\"\")","v":"ZAPNOUT"},{"$f":"IF(F24<>\"\",VLOOKUP(E24&\"|\"&F24,'IO-KOD'!$A$1:$M$70,11,0),\"\")","v":"-"},{"$f":"IF(F24<>\"\",VLOOKUP(E24&\"|\"&F24,'IO-KOD'!$A$1:$M$70,12,0),\"\")","v":"-"},{"$f":"IF(F24<>\"\",VLOOKUP(E24&\"|\"&F24,'IO-KOD'!$A$1:$M$70,13,0),\"\")","v":"-"}]
[null,"TS1234","NNO","VMS","Z","SPFG095C",{"$f":"IF(F25<>\"\",VLOOKUP(E25&\"|\"&F25,'IO-KOD'!$A$1:$E$70,5,0),\"\")","v":"Stupeň regulace cos fi - 0.95C - nastavit"},"TS1234.NNO.VMS.Z.SPFG095C",null,41234,161,18,{"$f":"IF(F25<>\"\",VLOOKUP(C25,Nap.hladiny!$A:$D,2,0),\"\")","v":5},{"$f":"IF(F25<>\"\",VLOOKUP(D25,Pole!$A:$B,2,0),\"\")","v":120},{"$f":"IF(F25<>\"\",VLOOKUP(E25&\"|\"&F25,'IO-KOD'!$A$1:$E$70,3,0),\"\")","v":12},{"$f":"IF(F25<>\"\",VLOOKUP(E25&\"|\"&F25,'IO-KOD'!$A$1:$E$70,4,0),\"\")","v":128},{"$f":"IF(F25<>\"\",VLOOKUP(C25,Nap.hladiny!$A:$D,3,0),\"\")","v":0},"OK",6062200,92,128,120,{"$f":"IF(F25<>\"\",VLOOKUP(E25&\"|\"&F25,'IO-KOD'!$A$1:$H$70,8,0),\"\")","v":45},{"$f":"IF(W25<>\"\",VLOOKUP(W25,'104-TI'!$A:$B,2,0),\"\")","v":"C_SC_NA_1"},null,{"$f":"IF(F25<>\"\",VLOOKUP(E25&\"|\"&F25,'IO-KOD'!$A$1:$M$70,9,0),\"\")","v":"VYPNOUT"},{"$f":"IF(F25<>\"\",VLOOKUP(E25&\"|\"&F25,'IO-KOD'!$A$1:$M$70,10,0),\"\")","v":"ZAPNOUT"},{"$f":"IF(F25<>\"\",VLOOKUP(E25&\"|\"&F25,'IO-KOD'!$A$1:$M$70,11,0),\"\")","v":"-"},{"$f":"IF(F25<>\"\",VLOOKUP(E25&\"|\"&F25,'IO-KOD'!$A$1:$M$70,12,0),\"\")","v":"-"},{"$f":"IF(F25<>\"\",VLOOKUP(E25&\"|\"&F25,'IO-KOD'!$A$1:$M$70,13,0),\"\")","v":"-"}]
[null,"TS1234","NNO","VMS","Z","SPFG100",{"$f":"IF(F26<>\"\",VLOOKUP(E26&\"|\"&F26,'IO-KOD'!$A$1:$E$70,5,0),\"\")","v":"Stupeň regulace cos fi - 1.00 - nastavit"},"TS1234.NNO.VMS.Z.SPFG100",null,41234,161,{"$f":"IF(J26<>\"\",MOD(J26,256),\"\")","v":18},{"$f":"IF(F26<>\"\",VLOOKUP(C26,Nap.hladiny!$A:$D,2,0),\"\")","v":5},{"$f":"IF(F26<>\"\",VLOOKUP(D26,Pole!$A:$B,2,0),\"\")","v":120},{"$f":"IF(F26<>\"\",VLOOKUP(E26&\"|\"&F26,'IO-KOD'!$A$1:$E$70,3,0),\"\")","v":12},{"$f":"IF(F26<>\"\",VLOOKUP(E26&\"|\"&F26,'IO-KOD'!$A$1:$E$70,4,0),\"\")","v":129},{"$f":"IF(F26<>\"\",VLOOKUP(C26,Nap.hladiny!$A:$D,3,0),\"\")","v":0},"OK",6062456,92,129,{"$f":"IF(S26<>\"\",MOD(S26,256),\"\")","v":120},{"$f":"IF(F26<>\"\",VLOOKUP(E26&\"|\"&F26,'IO-KOD'!$A$1:$H$70,8,0),\"\")","v":45},{"$f":"IF(W26<>\"\",VLOOKUP(W26,'104-TI'!$A:$B,2,0),\"\")","v":"C_SC_NA_1"},null,{"$f":"IF(F26<>\"\",VLOOKUP(E26&\"|\"&F26,'IO-KOD'!$A$1:$M$70,9,0),\"\")","v":"VYPNOUT"},{"$f":"IF(F26<>\"\",VLOOKUP(E26&\"|\"&F26,'IO-KOD'!$A$1:$M$70,10,0),\"\")","v":"ZAPNOUT"},{"$f":"IF(F26<>\"\",VLOOKUP(E26&\"|\"&F26,'IO-KOD'!$A$1:$M$70,11,0),\"\")","v":"-"},{"$f":"IF(F26<>\"\",VLOOKUP(E26&\"|\"&F26,'IO-KOD'!$A$1:$M$70,12,0),\"\")","v":"-"},{"$f":"IF(F26<>\"\",VLOOKUP(E26&\"|\"&F26,'IO-KOD'!$A$1:$M$70,13,0),\"\")","v":"-"}]
[null,"TS1234","NNO","VMS","Z","SPFG095L",{"$f":"IF(F27<>\"\",VLOOKUP(E27&\"|\"&F27,'IO-KOD'!$A$1:$E$70,5,0),\"\")","v":"Stupeň regulace cos fi - 0.95L - nastavit"},"TS1234.NNO.VMS.Z.SPFG095L",null,41234,161,{"$f":"IF(J27<>\"\",MOD(J27,256),\"\")","v":18},{"$f":"IF(F27<>\"\",VLOOKUP(C27,Nap.hladiny!$A:$D,2,0),\"\")","v":5},{"$f":"IF(F27<>\"\",VLOOKUP(D27,Pole!$A:$B,2,0),\"\")","v":120},{"$f":"IF(F27<>\"\",VLOOKUP(E27&\"|\"&F27,'IO-KOD'!$A$1:$E$70,3,0),\"\")","v":12},{"$f":"IF(F27<>\"\",VLOOKUP(E27&\"|\"&F27,'IO-KOD'!$A$1:$E$70,4,0),\"\")","v":130},{"$f":"IF(F27<>\"\",VLOOKUP(C27,Nap.hladiny!$A:$D,3,0),\"\")","v":0},"OK",6062712,92,130,{"$f":"IF(S27<>\"\",MOD(S27,256),\"\")","v":120},{"$f":"IF(F27<>\"\",VLOOKUP(E27&\"|\"&F27,'IO-KOD'!$A$1:$H$70,8,0),\"\")","v":45},{"$f":"IF(W27<>\"\",VLOOKUP(W27,'104-TI'!$A:$B,2,0),\"\")","v":"C_SC_NA_1"},null,{"$f":"IF(F27<>\"\",VLOOKUP(E27&\"|\"&F27,'IO-KOD'!$A$1:$M$70,9,0),\"\")","v":"VYPNOUT"},{"$f":"IF(F27<>\"\",VLOOKUP(E27&\"|\"&F27,'IO-KOD'!$A$1:$M$70,10,0),\"\")","v":"ZAPNOUT"},{"$f":"IF(F27<>\"\",VLOOKUP(E27&\"|\"&F27,'IO-KOD'!$A$1:$M$70,11,0),\"\")","v":"-"},{"$f":"IF(F27<>\"\",VLOOKUP(E27&\"|\"&F27,'IO-KOD'!$A$1:$M$70,12,0),\"\")","v":"-"},{"$f":"IF(F27<>\"\",VLOOKUP(E27&\"|\"&F27,'IO-KOD'!$A$1:$M$70,13,0),\"\")","v":"-"}]
[null,"TS1234","NNO","VMS","Z","SPFG090L",{"$f":"IF(F28<>\"\",VLOOKUP(E28&\"|\"&F28,'IO-KOD'!$A$1:$E$70,5,0),\"\")","v":"Stupeň regulace cos fi - 0.90L - nastavit"},"TS1234.NNO.VMS.Z.SPFG090L",null,41234,161,{"$f":"IF(J28<>\"\",MOD(J28,256),\"\")","v":18},{"$f":"IF(F28<>\"\",VLOOKUP(C28,Nap.hladiny!$A:$D,2,0),\"\")","v":5},{"$f":"IF(F28<>\"\",VLOOKUP(D28,Pole!$A:$B,2,0),\"\")","v":120},{"$f":"IF(F28<>\"\",VLOOKUP(E28&\"|\"&F28,'IO-KOD'!$A$1:$E$70,3,0),\"\")","v":12},{"$f":"IF(F28<>\"\",VLOOKUP(E28&\"|\"&F28,'IO-KOD'!$A$1:$E$70,4,0),\"\")","v":131},{"$f":"IF(F28<>\"\",VLOOKUP(C28,Nap.hladiny!$A:$D,3,0),\"\")","v":0},"OK",6062968,92,131,{"$f":"IF(S28<>\"\",MOD(S28,256),\"\")","v":120},{"$f":"IF(F28<>\"\",VLOOKUP(E28&\"|\"&F28,'IO-KOD'!$A$1:$H$70,8,0),\"\")","v":45},{"$f":"IF(W28<>\"\",VLOOKUP(W28,'104-TI'!$A:$B,2,0),\"\")","v":"C_SC_NA_1"},null,{"$f":"IF(F28<>\"\",VLOOKUP(E28&\"|\"&F28,'IO-KOD'!$A$1:$M$70,9,0),\"\")","v":"VYPNOUT"},{"$f":"IF(F28<>\"\",VLOOKUP(E28&\"|\"&F28,'IO-KOD'!$A$1:$M$70,10,0),\"\")","v":"ZAPNOUT"},{"$f":"IF(F28<>\"\",VLOOKUP(E28&\"|\"&F28,'IO-KOD'!$A$1:$M$70,11,0),\"\")","v":"-"},{"$f":"IF(F28<>\"\",VLOOKUP(E28&\"|\"&F28,'IO-KOD'!$A$1:$M$70,12,0),\"\")","v":"-"},{"$f":"IF(F28<>\"\",VLOOKUP(E28&\"|\"&F28,'IO-KOD'!$A$1:$M$70,13,0),\"\")","v":"-"}]
[null,"TS1234","NNO","VMS","S","SPFG090C",{"$f":"IF(F29<>\"\",VLOOKUP(E29&\"|\"&F29,'IO-KOD'!$A$1:$E$70,5,0),\"\")","v":"Stupeň regulace cos fi - 0.90C - nastaveno"},"TS1234.NNO.VMS.S.SPFG090C",null,41234,161,{"$f":"IF(J29<>\"\",MOD(J29,256),\"\")","v":18},{"$f":"IF(F29<>\"\",VLOOKUP(C29,Nap.hladiny!$A:$D,2,0),\"\")","v":5},{"$f":"IF(F29<>\"\",VLOOKUP(D29,Pole!$A:$B,2,0),\"\")","v":120},{"$f":"IF(F29<>\"\",VLOOKUP(E29&\"|\"&F29,'IO-KOD'!$A$1:$E$70,3,0),\"\")","v":6},{"$f":"IF(F29<>\"\",VLOOKUP(E29&\"|\"&F29,'IO-KOD'!$A$1:$E$70,4,0),\"\")","v":226},{"$f":"IF(F29<>\"\",VLOOKUP(C29,Nap.hladiny!$A:$D,3,0),\"\")","v":0},"OK",5694072,86,226,{"$f":"IF(S29<>\"\",MOD(S29,256),\"\")","v":120},{"$f":"IF(F29<>\"\",VLOOKUP(E29&\"|\"&F29,'IO-KOD'!$A$1:$H$70,8,0),\"\")","v":30},{"$f":"IF(W29<>\"\",VLOOKUP(W29,'104-TI'!$A:$B,2,0),\"\")","v":"M_SP_TB_1"},null,{"$f":"IF(F29<>\"\",VLOOKUP(E29&\"|\"&F29,'IO-KOD'!$A$1:$M$70,9,0),\"\")","v":"VYPNUTO"},{"$f":"IF(F29<>\"\",VLOOKUP(E29&\"|\"&F29,'IO-KOD'!$A$1:$M$70,10,0),\"\")","v":"ZAPNUTO"},{"$f":"IF(F29<>\"\",VLOOKUP(E29&\"|\"&F29,'IO-KOD'!$A$1:$M$70,11,0),\"\")","v":"-"},{"$f":"IF(F29<>\"\",VLOOKUP(E29&\"|\"&F29,'IO-KOD'!$A$1:$M$70,12,0),\"\")","v":"-"},{"$f":"IF(F29<>\"\",VLOOKUP(E29&\"|\"&F29,'IO-KOD'!$A$1:$M$70,13,0),\"\")","v":"-"}]
[null,"TS1234","NNO","VMS","S","SPFG095C",{"$f":"IF(F30<>\"\",VLOOKUP(E30&\"|\"&F30,'IO-KOD'!$A$1:$E$70,5,0),\"\")","v":"Stupeň regulace cos fi - 0.95C - nastaveno"},"TS1234.NNO.VMS.S.SPFG095C",null,41234,161,18,{"$f":"IF(F30<>\"\",VLOOKUP(C30,Nap.hladiny!$A:$D,2,0),\"\")","v":5},{"$f":"IF(F30<>\"\",VLOOKUP(D30,Pole!$A:$B,2,0),\"\")","v":120},{"$f":"IF(F30<>\"\",VLOOKUP(E30&\"|\"&F30,'IO-KOD'!$A$1:$E$70,3,0),\"\")","v":6},{"$f":"IF(F30<>\"\",VLOOKUP(E30&\"|\"&F30,'IO-KOD'!$A$1:$E$70,4,0),\"\")","v":227},{"$f":"IF(F30<>\"\",VLOOKUP(C30,Nap.hladiny!$A:$D,3,0),\"\")","v":0},"OK",5694328,86,227,120,{"$f":"IF(F30<>\"\",VLOOKUP(E30&\"|\"&F30,'IO-KOD'!$A$1:$H$70,8,0),\"\")","v":30},{"$f":"IF(W30<>\"\",VLOOKUP(W30,'104-TI'!$A:$B,2,0),\"\")","v":"M_SP_TB_1"},null,{"$f":"IF(F30<>\"\",VLOOKUP(E30&\"|\"&F30,'IO-KOD'!$A$1:$M$70,9,0),\"\")","v":"VYPNUTO"},{"$f":"IF(F30<>\"\",VLOOKUP(E30&\"|\"&F30,'IO-KOD'!$A$1:$M$70,10,0),\"\")","v":"ZAPNUTO"},{"$f":"IF(F30<>\"\",VLOOKUP(E30&\"|\"&F30,'IO-KOD'!$A$1:$M$70,11,0),\"\")","v":"-"},{"$f":"IF(F30<>\"\",VLOOKUP(E30&\"|\"&F30,'IO-KOD'!$A$1:$M$70,12,0),\"\")","v":"-"},{"$f":"IF(F30<>\"\",VLOOKUP(E30&\"|\"&F30,'IO-KOD'!$A$1:$M$70,13,0),\"\")","v":"-"}]
[null,"TS1234","NNO","VMS","S","SPFG100",{"$f":"IF(F31<>\"\",VLOOKUP(E31&\"|\"&F31,'IO-KOD'!$A$1:$E$70,5,0),\"\")","v":"Stupeň regulace cos fi - 1.00 - nastaveno"},"TS1234.NNO.VMS.S.SPFG100",null,41234,161,18,{"$f":"IF(F31<>\"\",VLOOKUP(C31,Nap.hladiny!$A:$D,2,0),\"\")","v":5},{"$f":"IF(F31<>\"\",VLOOKUP(D31,Pole!$A:$B,2,0),\"\")","v":120},{"$f":"IF(F31<>\"\",VLOOKUP(E31&\"|\"&F31,'IO-KOD'!$A$1:$E$70,3,0),\"\")","v":6},{"$f":"IF(F31<>\"\",VLOOKUP(E31&\"|\"&F31,'IO-KOD'!$A$1:$E$70,4,0),\"\")","v":228},{"$f":"IF(F31<>\"\",VLOOKUP(C31,Nap.hladiny!$A:$D,3,0),\"\")","v":0},"OK",5694584,86,228,120,{"$f":"IF(F31<>\"\",VLOOKUP(E31&\"|\"&F31,'IO-KOD'!$A$1:$H$70,8,0),\"\")","v":30},{"$f":"IF(W31<>\"\",VLOOKUP(W31,'104-TI'!$A:$B,2,0),\"\")","v":"M_SP_TB_1"},null,{"$f":"IF(F31<>\"\",VLOOKUP(E31&\"|\"&F31,'IO-KOD'!$A$1:$M$70,9,0),\"\")","v":"VYPNUTO"},{"$f":"IF(F31<>\"\",VLOOKUP(E31&\"|\"&F31,'IO-KOD'!$A$1:$M$70,10,0),\"\")","v":"ZAPNUTO"},{"$f":"IF(F31<>\"\",VLOOKUP(E31&\"|\"&F31,'IO-KOD'!$A$1:$M$70,11,0),\"\")","v":"-"},{"$f":"IF(F31<>\"\",VLOOKUP(E31&\"|\"&F31,'IO-KOD'!$A$1:$M$70,12,0),\"\")","v":"-"},{"$f":"IF(F31<>\"\",VLOOKUP(E31&\"|\"&F31,'IO-KOD'!$A$1:$M$70,13,0),\"\")","v":"-"}]
[null,"TS1234","NNO","VMS","S","SPFG095L",{"$f":"IF(F32<>\"\",VLOOKUP(E32&\"|\"&F32,'IO-KOD'!$A$1:$E$70,5,0),\"\")","v":"Stupeň regulace cos fi - 0.95L - nastaveno"},"TS1234.NNO.VMS.S.SPFG095L",null,41234,161,18,{"$f":"IF(F32<>\"\",VLOOKUP(C32,Nap.hladiny!$A:$D,2,0),\"\")","v":5},{"$f":"IF(F32<>\"\",VLOOKUP(D32,Pole!$A:$B,2,0),\"\")","v":120},{"$f":"IF(F32<>\"\",VLOOKUP(E32&\"|\"&F32,'IO-KOD'!$A$1:$E$70,3,0),\"\")","v":6},{"$f":"IF(F32<>\"\",VLOOKUP(E32&\"|\"&F32,'IO-KOD'!$A$1:$E$70,4,0),\"\")","v":229},{"$f":"IF(F32<>\"\",VLOOKUP(C32,Nap.hladiny!$A:$D,3,0),\"\")","v":0},"OK",5694840,86,229,120,{"$f":"IF(F32<>\"\",VLOOKUP(E32&\"|\"&F32,'IO-KOD'!$A$1:$H$70,8,0),\"\")","v":30},{"$f":"IF(W32<>\"\",VLOOKUP(W32,'104-TI'!$A:$B,2,0),\"\")","v":"M_SP_TB_1"},null,{"$f":"IF(F32<>\"\",VLOOKUP(E32&\"|\"&F32,'IO-KOD'!$A$1:$M$70,9,0),\"\")","v":"VYPNUTO"},{"$f":"IF(F32<>\"\",VLOOKUP(E32&\"|\"&F32,'IO-KOD'!$A$1:$M$70,10,0),\"\")","v":"ZAPNUTO"},{"$f":"IF(F32<>\"\",VLOOKUP(E32&\"|\"&F32,'IO-KOD'!$A$1:$M$70,11,0),\"\")","v":"-"},{"$f":"IF(F32<>\"\",VLOOKUP(E32&\"|\"&F32,'IO-KOD'!$A$1:$M$70,12,0),\"\")","v":"-"},{"$f":"IF(F32<>\"\",VLOOKUP(E32&\"|\"&F32,'IO-KOD'!$A$1:$M$70,13,0),\"\")","v":"-"}]
[null,"TS1234","NNO","VMS","S","SPFG090L",{"$f":"IF(F33<>\"\",VLOOKUP(E33&\"|\"&F33,'IO-KOD'!$A$1:$E$70,5,0),\"\")","v":"Stupeň regulace cos fi - 0.90L - nastaveno"},"TS1234.NNO.VMS.S.SPFG090L",null,41234,161,18,{"$f":"IF(F33<>\"\",VLOOKUP(C33,Nap.hladiny!$A:$D,2,0),\"\")","v":5},{"$f":"IF(F33<>\"\",VLOOKUP(D33,Pole!$A:$B,2,0),\"\")","v":120},{"$f":"IF(F33<>\"\",VLOOKUP(E33&\"|\"&F33,'IO-KOD'!$A$1:$E$70,3,0),\"\")","v":6},{"$f":"IF(F33<>\"\",VLOOKUP(E33&\"|\"&F33,'IO-KOD'!$A$1:$E$70,4,0),\"\")","v":230},{"$f":"IF(F33<>\"\",VLOOKUP(C33,Nap.hladiny!$A:$D,3,0),\"\")","v":0},"OK",5695096,86,230,120,{"$f":"IF(F33<>\"\",VLOOKUP(E33&\"|\"&F33,'IO-KOD'!$A$1:$H$70,8,0),\"\")","v":30},{"$f":"IF(W33<>\"\",VLOOKUP(W33,'104-TI'!$A:$B,2,0),\"\")","v":"M_SP_TB_1"},null,{"$f":"IF(F33<>\"\",VLOOKUP(E33&\"|\"&F33,'IO-KOD'!$A$1:$M$70,9,0),\"\")","v":"VYPNUTO"},{"$f":"IF(F33<>\"\",VLOOKUP(E33&\"|\"&F33,'IO-KOD'!$A$1:$M$70,10,0),\"\")","v":"ZAPNUTO"},{"$f":"IF(F33<>\"\",VLOOKUP(E33&\"|\"&F33,'IO-KOD'!$A$1:$M$70,11,0),\"\")","v":"-"},{"$f":"IF(F33<>\"\",VLOOKUP(E33&\"|\"&F33,'IO-KOD'!$A$1:$M$70,12,0),\"\")","v":"-"},{"$f":"IF(F33<>\"\",VLOOKUP(E33&\"|\"&F33,'IO-KOD'!$A$1:$M$70,13,0),\"\")","v":"-"}]
[null,"TS1234","NNO","VM1","S","QM",{"$f":"IF(F34<>\"\",VLOOKUP(E34&\"|\"&F34,'IO-KOD'!$A$1:$E$70,5,0),\"\")","v":"Vypínač QM - stav"},"TS1234.NNO.VM1.S.QM",null,41234,161,18,{"$f":"IF(F34<>\"\",VLOOKUP(C34,Nap.hladiny!$A:$D,2,0),\"\")","v":5},{"$f":"IF(F34<>\"\",VLOOKUP(D34,Pole!$A:$B,2,0),\"\")","v":121},{"$f":"IF(F34<>\"\",VLOOKUP(E34&\"|\"&F34,'IO-KOD'!$A$1:$E$70,3,0),\"\")","v":0},{"$f":"IF(F34<>\"\",VLOOKUP(E34&\"|\"&F34,'IO-KOD'!$A$1:$E$70,4,0),\"\")","v":1},{"$f":"IF(F34<>\"\",VLOOKUP(C34,Nap.hladiny!$A:$D,3,0),\"\")","v":0},"OK",5243257,80,1,121,{"$f":"IF(F34<>\"\",VLOOKUP(E34&\"|\"&F34,'IO-KOD'!$A$1:$H$70,8,0),\"\")","v":31},{"$f":"IF(W34<>\"\",VLOOKUP(W34,'104-TI'!$A:$B,2,0),\"\")","v":"M_DP_TB_1"},null,{"$f":"IF(F34<>\"\",VLOOKUP(E34&\"|\"&F34,'IO-KOD'!$A$1:$M$70,9,0),\"\")","v":"MEZIPOLOHA"},{"$f":"IF(F34<>\"\",VLOOKUP(E34&\"|\"&F34,'IO-KOD'!$A$1:$M$70,10,0),\"\")","v":"VYPNUTO"},{"$f":"IF(F34<>\"\",VLOOKUP(E34&\"|\"&F34,'IO-KOD'!$A$1:$M$70,11,0),\"\")","v":"ZAPNUTO"},{"$f":"IF(F34<>\"\",VLOOKUP(E34&\"|\"&F34,'IO-KOD'!$A$1:$M$70,12,0),\"\")","v":"PORUCHA"},{"$f":"IF(F34<>\"\",VLOOKUP(E34&\"|\"&F34,'IO-KOD'!$A$1:$M$70,13,0),\"\")","v":"-"}]
[null,"TS1234","NNO","VM1","P","H100T",{"$f":"IF(F35<>\"\",VLOOKUP(E35&\"|\"&F35,'IO-KOD'!$A$1:$E$70,5,0),\"\")","v":"Ochrany - působení ochran"},"TS1234.NNO.VM1.P.H100T",null,41234,161,18,{"$f":"IF(F35<>\"\",VLOOKUP(C35,Nap.hladiny!$A:$D,2,0),\"\")","v":5},{"$f":"IF(F35<>\"\",VLOOKUP(D35,Pole!$A:$B,2,0),\"\")","v":121},{"$f":"IF(F35<>\"\",VLOOKUP(E35&\"|\"&F35,'IO-KOD'!$A$1:$E$70,3,0),\"\")","v":1},{"$f":"IF(F35<>\"\",VLOOKUP(E35&\"|\"&F35,'IO-KOD'!$A$1:$E$70,4,0),\"\")","v":1},{"$f":"IF(F35<>\"\",VLOOKUP(C35,Nap.hladiny!$A:$D,3,0),\"\")","v":0},"OK",5308793,81,1,121,{"$f":"IF(F35<>\"\",VLOOKUP(E35&\"|\"&F35,'IO-KOD'!$A$1:$H$70,8,0),\"\")","v":30},{"$f":"IF(W35<>\"\",VLOOKUP(W35,'104-TI'!$A:$B,2,0),\"\")","v":"M_SP_TB_1"},null,{"$f":"IF(F35<>\"\",VLOOKUP(E35&\"|\"&F35,'IO-KOD'!$A$1:$M$70,9,0),\"\")","v":"KONEC"},{"$f":"IF(F35<>\"\",VLOOKUP(E35&\"|\"&F35,'IO-KOD'!$A$1:$M$70,10,0),\"\")","v":"ZAČÁTEK"},{"$f":"IF(F35<>\"\",VLOOKUP(E35&\"|\"&F35,'IO-KOD'!$A$1:$M$70,11,0),\"\")","v":"-"},{"$f":"IF(F35<>\"\",VLOOKUP(E35&\"|\"&F35,'IO-KOD'!$A$1:$M$70,12,0),\"\")","v":"-"},{"$f":"IF(F35<>\"\",VLOOKUP(E35&\"|\"&F35,'IO-KOD'!$A$1:$M$70,13,0),\"\")","v":"-"}]
[null,"TS1234","NNO","VM1","P","H100IF",{"$f":"IF(F36<>\"\",VLOOKUP(E36&\"|\"&F36,'IO-KOD'!$A$1:$E$70,5,0),\"\")","v":"Ochrany - vnitřní porucha"},"TS1234.NNO.VM1.P.H100IF",null,41234,161,18,{"$f":"IF(F36<>\"\",VLOOKUP(C36,Nap.hladiny!$A:$D,2,0),\"\")","v":5},{"$f":"IF(F36<>\"\",VLOOKUP(D36,Pole!$A:$B,2,0),\"\")","v":121},{"$f":"IF(F36<>\"\",VLOOKUP(E36&\"|\"&F36,'IO-KOD'!$A$1:$E$70,3,0),\"\")","v":2},{"$f":"IF(F36<>\"\",VLOOKUP(E36&\"|\"&F36,'IO-KOD'!$A$1:$E$70,4,0),\"\")","v":17},{"$f":"IF(F36<>\"\",VLOOKUP(C36,Nap.hladiny!$A:$D,3,0),\"\")","v":0},"OK",5378425,82,17,121,{"$f":"IF(F36<>\"\",VLOOKUP(E36&\"|\"&F36,'IO-KOD'!$A$1:$H$70,8,0),\"\")","v":30},{"$f":"IF(W36<>\"\",VLOOKUP(W36,'104-TI'!$A:$B,2,0),\"\")","v":"M_SP_TB_1"},null,{"$f":"IF(F36<>\"\",VLOOKUP(E36&\"|\"&F36,'IO-KOD'!$A$1:$M$70,9,0),\"\")","v":"KONEC"},{"$f":"IF(F36<>\"\",VLOOKUP(E36&\"|\"&F36,'IO-KOD'!$A$1:$M$70,10,0),\"\")","v":"ZAČÁTEK"},{"$f":"IF(F36<>\"\",VLOOKUP(E36&\"|\"&F36,'IO-KOD'!$A$1:$M$70,11,0),\"\")","v":"-"},{"$f":"IF(F36<>\"\",VLOOKUP(E36&\"|\"&F36,'IO-KOD'!$A$1:$M$70,12,0),\"\")","v":"-"},{"$f":"IF(F36<>\"\",VLOOKUP(E36&\"|\"&F36,'IO-KOD'!$A$1:$M$70,13,0),\"\")","v":"-"}]
[null,"TS1234","NNO","VM2","S","QM",{"$f":"IF(F37<>\"\",VLOOKUP(E37&\"|\"&F37,'IO-KOD'!$A$1:$E$70,5,0),\"\")","v":"Vypínač QM - stav"},"TS1234.NNO.VM2.S.QM",null,41234,161,18,{"$f":"IF(F37<>\"\",VLOOKUP(C37,Nap.hladiny!$A:$D,2,0),\"\")","v":5},{"$f":"IF(F37<>\"\",VLOOKUP(D37,Pole!$A:$B,2,0),\"\")","v":122},{"$f":"IF(F37<>\"\",VLOOKUP(E37&\"|\"&F37,'IO-KOD'!$A$1:$E$70,3,0),\"\")","v":0},{"$f":"IF(F37<>\"\",VLOOKUP(E37&\"|\"&F37,'IO-KOD'!$A$1:$E$70,4,0),\"\")","v":1},{"$f":"IF(F37<>\"\",VLOOKUP(C37,Nap.hladiny!$A:$D,3,0),\"\")","v":0},"OK",5243258,80,1,122,{"$f":"IF(F37<>\"\",VLOOKUP(E37&\"|\"&F37,'IO-KOD'!$A$1:$H$70,8,0),\"\")","v":31},{"$f":"IF(W37<>\"\",VLOOKUP(W37,'104-TI'!$A:$B,2,0),\"\")","v":"M_DP_TB_1"},null,{"$f":"IF(F37<>\"\",VLOOKUP(E37&\"|\"&F37,'IO-KOD'!$A$1:$M$70,9,0),\"\")","v":"MEZIPOLOHA"},{"$f":"IF(F37<>\"\",VLOOKUP(E37&\"|\"&F37,'IO-KOD'!$A$1:$M$70,10,0),\"\")","v":"VYPNUTO"},{"$f":"IF(F37<>\"\",VLOOKUP(E37&\"|\"&F37,'IO-KOD'!$A$1:$M$70,11,0),\"\")","v":"ZAPNUTO"},{"$f":"IF(F37<>\"\",VLOOKUP(E37&\"|\"&F37,'IO-KOD'!$A$1:$M$70,12,0),\"\")","v":"PORUCHA"},{"$f":"IF(F37<>\"\",VLOOKUP(E37&\"|\"&F37,'IO-KOD'!$A$1:$M$70,13,0),\"\")","v":"-"}]
[null,"TS1234","NNO","VM2","P","H100T",{"$f":"IF(F38<>\"\",VLOOKUP(E38&\"|\"&F38,'IO-KOD'!$A$1:$E$70,5,0),\"\")","v":"Ochrany - působení ochran"},"TS1234.NNO.VM2.P.H100T",null,41234,161,18,{"$f":"IF(F38<>\"\",VLOOKUP(C38,Nap.hladiny!$A:$D,2,0),\"\")","v":5},{"$f":"IF(F38<>\"\",VLOOKUP(D38,Pole!$A:$B,2,0),\"\")","v":122},{"$f":"IF(F38<>\"\",VLOOKUP(E38&\"|\"&F38,'IO-KOD'!$A$1:$E$70,3,0),\"\")","v":1},{"$f":"IF(F38<>\"\",VLOOKUP(E38&\"|\"&F38,'IO-KOD'!$A$1:$E$70,4,0),\"\")","v":1},{"$f":"IF(F38<>\"\",VLOOKUP(C38,Nap.hladiny!$A:$D,3,0),\"\")","v":0},"OK",5308794,81,1,122,{"$f":"IF(F38<>\"\",VLOOKUP(E38&\"|\"&F38,'IO-KOD'!$A$1:$H$70,8,0),\"\")","v":30},{"$f":"IF(W38<>\"\",VLOOKUP(W38,'104-TI'!$A:$B,2,0),\"\")","v":"M_SP_TB_1"},null,{"$f":"IF(F38<>\"\",VLOOKUP(E38&\"|\"&F38,'IO-KOD'!$A$1:$M$70,9,0),\"\")","v":"KONEC"},{"$f":"IF(F38<>\"\",VLOOKUP(E38&\"|\"&F38,'IO-KOD'!$A$1:$M$70,10,0),\"\")","v":"ZAČÁTEK"},{"$f":"IF(F38<>\"\",VLOOKUP(E38&\"|\"&F38,'IO-KOD'!$A$1:$M$70,11,0),\"\")","v":"-"},{"$f":"IF(F38<>\"\",VLOOKUP(E38&\"|\"&F38,'IO-KOD'!$A$1:$M$70,12,0),\"\")","v":"-"},{"$f":"IF(F38<>\"\",VLOOKUP(E38&\"|\"&F38,'IO-KOD'!$A$1:$M$70,13,0),\"\")","v":"-"}]
[null,"TS1234","NNO","VM2","P","H100IF",{"$f":"IF(F39<>\"\",VLOOKUP(E39&\"|\"&F39,'IO-KOD'!$A$1:$E$70,5,0),\"\")","v":"Ochrany - vnitřní porucha"},{"$f":"IF(F39<>\"\",SUBSTITUTE(B39&\".\"&C39&\".\"&D39&\".\"&E39&\".\"&F39,\" \",\"\"),\"\")","v":"TS1234.NNO.VM2.P.H100IF"},null,41234,{"$f":"IF(J39<>\"\",INT(MOD(J39,65536)/256),\"\")","v":161},18,{"$f":"IF(F39<>\"\",VLOOKUP(C39,Nap.hladiny!$A:$D,2,0),\"\")","v":5},{"$f":"IF(F39<>\"\",VLOOKUP(D39,Pole!$A:$B,2,0),\"\")","v":122},{"$f":"IF(F39<>\"\",VLOOKUP(E39&\"|\"&F39,'IO-KOD'!$A$1:$E$70,3,0),\"\")","v":2},{"$f":"IF(F39<>\"\",VLOOKUP(E39&\"|\"&F39,'IO-KOD'!$A$1:$E$70,4,0),\"\")","v":17},{"$f":"IF(F39<>\"\",VLOOKUP(C39,Nap.hladiny!$A:$D,3,0),\"\")","v":0},{"$f":"IF(F39<>\"\",IF(AND(COUNTIFS($S$7:$S$499, S39,$A$7:$A$499,\"<>N\")>1, S39<>\"\",A39<>\"N\"), \"DUPLICITA\", \"OK\"),\"\")","v":"OK"},5378426,{"$f":"IF(S39<>\"\",(S39-(U39*256)-V39)/65536,\"\")","v":82},{"$f":"IF(S39<>\"\",INT(MOD(S39,65536)/256),\"\")","v":17},122,{"$f":"IF(F39<>\"\",VLOOKUP(E39&\"|\"&F39,'IO-KOD'!$A$1:$H$70,8,0),\"\")","v":30},{"$f":"IF(W39<>\"\",VLOOKUP(W39,'104-TI'!$A:$B,2,0),\"\")","v":"M_SP_TB_1"},null,{"$f":"IF(F39<>\"\",VLOOKUP(E39&\"|\"&F39,'IO-KOD'!$A$1:$M$70,9,0),\"\")","v":"KONEC"},{"$f":"IF(F39<>\"\",VLOOKUP(E39&\"|\"&F39,'IO-KOD'!$A$1:$M$70,10,0),\"\")","v":"ZAČÁTEK"},{"$f":"IF(F39<>\"\",VLOOKUP(E39&\"|\"&F39,'IO-KOD'!$A$1:$M$70,11,0),\"\")","v":"-"},{"$f":"IF(F39<>\"\",VLOOKUP(E39&\"|\"&F39,'IO-KOD'!$A$1:$M$70,12,0),\"\")","v":"-"},{"$f":"IF(F39<>\"\",VLOOKUP(E39&\"|\"&F39,'IO-KOD'!$A$1:$M$70,13,0),\"\")","v":"-"}]
[null,null,null,null,null,null,{"$f":"IF(F40<>\"\",VLOOKUP(E40&\"|\"&F40,'IO-KOD'!$A$1:$E$70,5,0),\"\")","v":""},"",null,"","","",{"$f":"IF(F40<>\"\",VLOOKUP(C40,Nap.hladiny!$A:$D,2,0),\"\")","v":""},{"$f":"IF(F40<>\"\",VLOOKUP(D40,Pole!$A:$B,2,0),\"\")","v":""},{"$f":"IF(F40<>\"\",VLOOKUP(E40&\"|\"&F40,'IO-KOD'!$A$1:$E$70,3,0),\"\")","v":""},{"$f":"IF(F40<>\"\",VLOOKUP(E40&\"|\"&F40,'IO-KOD'!$A$1:$E$70,4,0),\"\")","v":""},{"$f":"IF(F40<>\"\",VLOOKUP(C40,Nap.hladiny!$A:$D,3,0),\"\")","v":""},"",{"$f":"IF(F40=\"\",\"\",(M40*2^20)+(O40*2^16)+(P40*2^8)+(Q40*2^7)+N40)","v":""},"","","",{"$f":"IF(F40<>\"\",VLOOKUP(E40&\"|\"&F40,'IO-KOD'!$A$1:$H$70,8,0),\"\")","v":""},{"$f":"IF(W40<>\"\",VLOOKUP(W40,'104-TI'!$A:$B,2,0),\"\")","v":""},null,{"$f":"IF(F40<>\"\",VLOOKUP(E40&\"|\"&F40,'IO-KOD'!$A$1:$M$70,9,0),\"\")","v":""},{"$f":"IF(F40<>\"\",VLOOKUP(E40&\"|\"&F40,'IO-KOD'!$A$1:$M$70,10,0),\"\")","v":""},{"$f":"IF(F40<>\"\",VLOOKUP(E40&\"|\"&F40,'IO-KOD'!$A$1:$M$70,11,0),\"\")","v":""},{"$f":"IF(F40<>\"\",VLOOKUP(E40&\"|\"&F40,'IO-KOD'!$A$1:$M$70,12,0),\"\")","v":""},{"$f":"IF(F40<>\"\",VLOOKUP(E40&\"|\"&F40,'IO-KOD'!$A$1:$M$70,13,0),\"\")","v":""}]
[null,null,null,null,null,null,{"$f":"IF(F41<>\"\",VLOOKUP(E41&\"|\"&F41,'IO-KOD'!$A$1:$E$70,5,0),\"\")","v":""},"",null,"","","",{"$f":"IF(F41<>\"\",VLOOKUP(C41,Nap.hladiny!$A:$D,2,0),\"\")","v":""},{"$f":"IF(F41<>\"\",VLOOKUP(D41,Pole!$A:$B,2,0),\"\")","v":""},{"$f":"IF(F41<>\"\",VLOOKUP(E41&\"|\"&F41,'IO-KOD'!$A$1:$E$70,3,0),\"\")","v":""},{"$f":"IF(F41<>\"\",VLOOKUP(E41&\"|\"&F41,'IO-KOD'!$A$1:$E$70,4,0),\"\")","v":""},{"$f":"IF(F41<>\"\",VLOOKUP(C41,Nap.hladiny!$A:$D,3,0),\"\")","v":""},"","","","","",{"$f":"IF(F41<>\"\",VLOOKUP(E41&\"|\"&F41,'IO-KOD'!$A$1:$H$70,8,0),\"\")","v":""},{"$f":"IF(W41<>\"\",VLOOKUP(W41,'104-TI'!$A:$B,2,0),\"\")","v":""},null,{"$f":"IF(F41<>\"\",VLOOKUP(E41&\"|\"&F41,'IO-KOD'!$A$1:$M$70,9,0),\"\")","v":""},{"$f":"IF(F41<>\"\",VLOOKUP(E41&\"|\"&F41,'IO-KOD'!$A$1:$M$70,10,0),\"\")","v":""},{"$f":"IF(F41<>\"\",VLOOKUP(E41&\"|\"&F41,'IO-KOD'!$A$1:$M$70,11,0),\"\")","v":""},{"$f":"IF(F41<>\"\",VLOOKUP(E41&\"|\"&F41,'IO-KOD'!$A$1:$M$70,12,0),\"\")","v":""},{"$f":"IF(F41<>\"\",VLOOKUP(E41&\"|\"&F41,'IO-KOD'!$A$1:$M$70,13,0),\"\")","v":""}]
[null,null,null,null,null,null,{"$f":"IF(F42<>\"\",VLOOKUP(E42&\"|\"&F42,'IO-KOD'!$A$1:$E$70,5,0),\"\")","v":""},"",null,"","","",{"$f":"IF(F42<>\"\",VLOOKUP(C42,Nap.hladiny!$A:$D,2,0),\"\")","v":""},{"$f":"IF(F42<>\"\",VLOOKUP(D42,Pole!$A:$B,2,0),\"\")","v":""},{"$f":"IF(F42<>\"\",VLOOKUP(E42&\"|\"&F42,'IO-KOD'!$A$1:$E$70,3,0),\"\")","v":""},{"$f":"IF(F42<>\"\",VLOOKUP(E42&\"|\"&F42,'IO-KOD'!$A$1:$E$70,4,0),\"\")","v":""},{"$f":"IF(F42<>\"\",VLOOKUP(C42,Nap.hladiny!$A:$D,3,0),\"\")","v":""},"","","","","",{"$f":"IF(F42<>\"\",VLOOKUP(E42&\"|\"&F42,'IO-KOD'!$A$1:$H$70,8,0),\"\")","v":""},{"$f":"IF(W42<>\"\",VLOOKUP(W42,'104-TI'!$A:$B,2,0),\"\")","v":""},null,{"$f":"IF(F42<>\"\",VLOOKUP(E42&\"|\"&F42,'IO-KOD'!$A$1:$M$70,9,0),\"\")","v":""},{"$f":"IF(F42<>\"\",VLOOKUP(E42&\"|\"&F42,'IO-KOD'!$A$1:$M$70,10,0),\"\")","v":""},{"$f":"IF(F42<>\"\",VLOOKUP(E42&\"|\"&F42,'IO-KOD'!$A$1:$M$70,11,0),\"\")","v":""},{"$f":"IF(F42<>\"\",VLOOKUP(E42&\"|\"&F42,'IO-KOD'!$A$1:$M$70,12,0),\"\")","v":""},{"$f":"IF(F42<>\"\",VLOOKUP(E42&\"|\"&F42,'IO-KOD'!$A$1:$M$70,13,0),\"\")","v":""}]
[null,null,null,null,null,null,{"$f":"IF(F43<>\"\",VLOOKUP(E43&\"|\"&F43,'IO-KOD'!$A$1:$E$70,5,0),\"\")","v":""},"",null,"","","",{"$f":"IF(F43<>\"\",VLOOKUP(C43,Nap.hladiny!$A:$D,2,0),\"\")","v":""},{"$f":"IF(F43<>\"\",VLOOKUP(D43,Pole!$A:$B,2,0),\"\")","v":""},{"$f":"IF(F43<>\"\",VLOOKUP(E43&\"|\"&F43,'IO-KOD'!$A$1:$E$70,3,0),\"\")","v":""},{"$f":"IF(F43<>\"\",VLOOKUP(E43&\"|\"&F43,'IO-KOD'!$A$1:$E$70,4,0),\"\")","v":""},{"$f":"IF(F43<>\"\",VLOOKUP(C43,Nap.hladiny!$A:$D,3,0),\"\")","v":""},"","","","","",{"$f":"IF(F43<>\"\",VLOOKUP(E43&\"|\"&F43,'IO-KOD'!$A$1:$H$70,8,0),\"\")","v":""},{"$f":"IF(W43<>\"\",VLOOKUP(W43,'104-TI'!$A:$B,2,0),\"\")","v":""},null,{"$f":"IF(F43<>\"\",VLOOKUP(E43&\"|\"&F43,'IO-KOD'!$A$1:$M$70,9,0),\"\")","v":""},{"$f":"IF(F43<>\"\",VLOOKUP(E43&\"|\"&F43,'IO-KOD'!$A$1:$M$70,10,0),\"\")","v":""},{"$f":"IF(F43<>\"\",VLOOKUP(E43&\"|\"&F43,'IO-KOD'!$A$1:$M$70,11,0),\"\")","v":""},{"$f":"IF(F43<>\"\",VLOOKUP(E43&\"|\"&F43,'IO-KOD'!$A$1:$M$70,12,0),\"\")","v":""},{"$f":"IF(F43<>\"\",VLOOKUP(E43&\"|\"&F43,'IO-KOD'!$A$1:$M$70,13,0),\"\")","v":""}]
[null,null,null,null,null,null,{"$f":"IF(F44<>\"\",VLOOKUP(E44&\"|\"&F44,'IO-KOD'!$A$1:$E$70,5,0),\"\")","v":""},"",null,"","","",{"$f":"IF(F44<>\"\",VLOOKUP(C44,Nap.hladiny!$A:$D,2,0),\"\")","v":""},{"$f":"IF(F44<>\"\",VLOOKUP(D44,Pole!$A:$B,2,0),\"\")","v":""},{"$f":"IF(F44<>\"\",VLOOKUP(E44&\"|\"&F44,'IO-KOD'!$A$1:$E$70,3,0),\"\")","v":""},{"$f":"IF(F44<>\"\",VLOOKUP(E44&\"|\"&F44,'IO-KOD'!$A$1:$E$70,4,0),\"\")","v":""},{"$f":"IF(F44<>\"\",VLOOKUP(C44,Nap.hladiny!$A:$D,3,0),\"\")","v":""},"","","","","",{"$f":"IF(F44<>\"\",VLOOKUP(E44&\"|\"&F44,'IO-KOD'!$A$1:$H$70,8,0),\"\")","v":""},{"$f":"IF(W44<>\"\",VLOOKUP(W44,'104-TI'!$A:$B,2,0),\"\")","v":""},null,{"$f":"IF(F44<>\"\",VLOOKUP(E44&\"|\"&F44,'IO-KOD'!$A$1:$M$70,9,0),\"\")","v":""},{"$f":"IF(F44<>\"\",VLOOKUP(E44&\"|\"&F44,'IO-KOD'!$A$1:$M$70,10,0),\"\")","v":""},{"$f":"IF(F44<>\"\",VLOOKUP(E44&\"|\"&F44,'IO-KOD'!$A$1:$M$70,11,0),\"\")","v":""},{"$f":"IF(F44<>\"\",VLOOKUP(E44&\"|\"&F44,'IO-KOD'!$A$1:$M$70,12,0),\"\")","v":""},{"$f":"IF(F44<>\"\",VLOOKUP(E44&\"|\"&F44,'IO-KOD'!$A$1:$M$70,13,0),\"\")","v":""}]
[null,null,null,null,null,null,{"$f":"IF(F45<>\"\",VLOOKUP(E45&\"|\"&F45,'IO-KOD'!$A$1:$E$70,5,0),\"\")","v":""},"",null,"","","",{"$f":"IF(F45<>\"\",VLOOKUP(C45,Nap.hladiny!$A:$D,2,0),\"\")","v":""},{"$f":"IF(F45<>\"\",VLOOKUP(D45,Pole!$A:$B,2,0),\"\")","v":""},{"$f":"IF(F45<>\"\",VLOOKUP(E45&\"|\"&F45,'IO-KOD'!$A$1:$E$70,3,0),\"\")","v":""},{"$f":"IF(F45<>\"\",VLOOKUP(E45&\"|\"&F45,'IO-KOD'!$A$1:$E$70,4,0),\"\")","v":""},{"$f":"IF(F45<>\"\",VLOOKUP(C45,Nap.hladiny!$A:$D,3,0),\"\")","v":""},"","","","","",{"$f":"IF(F45<>\"\",VLOOKUP(E45&\"|\"&F45,'IO-KOD'!$A$1:$H$70,8,0),\"\")","v":""},{"$f":"IF(W45<>\"\",VLOOKUP(W45,'104-TI'!$A:$B,2,0),\"\")","v":""},null,{"$f":"IF(F45<>\"\",VLOOKUP(E45&\"|\"&F45,'IO-KOD'!$A$1:$M$70,9,0),\"\")","v":""},{"$f":"IF(F45<>\"\",VLOOKUP(E45&\"|\"&F45,'IO-KOD'!$A$1:$M$70,10,0),\"\")","v":""},{"$f":"IF(F45<>\"\",VLOOKUP(E45&\"|\"&F45,'IO-KOD'!$A$1:$M$70,11,0),\"\")","v":""},{"$f":"IF(F45<>\"\",VLOOKUP(E45&\"|\"&F45,'IO-KOD'!$A$1:$M$70,12,0),\"\")","v":""},{"$f":"IF(F45<>\"\",VLOOKUP(E45&\"|\"&F45,'IO-KOD'!$A$1:$M$70,13,0),\"\")","v":""}]
[null,null,null,null,null,null,{"$f":"IF(F46<>\"\",VLOOKUP(E46&\"|\"&F46,'IO-KOD'!$A$1:$E$70,5,0),\"\")","v":""},"",null,"","","",{"$f":"IF(F46<>\"\",VLOOKUP(C46,Nap.hladiny!$A:$D,2,0),\"\")","v":""},{"$f":"IF(F46<>\"\",VLOOKUP(D46,Pole!$A:$B,2,0),\"\")","v":""},{"$f":"IF(F46<>\"\",VLOOKUP(E46&\"|\"&F46,'IO-KOD'!$A$1:$E$70,3,0),\"\")","v":""},{"$f":"IF(F46<>\"\",VLOOKUP(E46&\"|\"&F46,'IO-KOD'!$A$1:$E$70,4,0),\"\")","v":""},{"$f":"IF(F46<>\"\",VLOOKUP(C46,Nap.hladiny!$A:$D,3,0),\"\")","v":""},"","","","","",{"$f":"IF(F46<>\"\",VLOOKUP(E46&\"|\"&F46,'IO-KOD'!$A$1:$H$70,8,0),\"\")","v":""},{"$f":"IF(W46<>\"\",VLOOKUP(W46,'104-TI'!$A:$B,2,0),\"\")","v":""},null,{"$f":"IF(F46<>\"\",VLOOKUP(E46&\"|\"&F46,'IO-KOD'!$A$1:$M$70,9,0),\"\")","v":""},{"$f":"IF(F46<>\"\",VLOOKUP(E46&\"|\"&F46,'IO-KOD'!$A$1:$M$70,10,0),\"\")","v":""},{"$f":"IF(F46<>\"\",VLOOKUP(E46&\"|\"&F46,'IO-KOD'!$A$1:$M$70,11,0),\"\")","v":""},{"$f":"IF(F46<>\"\",VLOOKUP(E46&\"|\"&F46,'IO-KOD'!$A$1:$M$70,12,0),\"\")","v":""},{"$f":"IF(F46<>\"\",VLOOKUP(E46&\"|\"&F46,'IO-KOD'!$A$1:$M$70,13,0),\"\")","v":""}]
[null,null,null,null,null,null,{"$f":"IF(F47<>\"\",VLOOKUP(E47&\"|\"&F47,'IO-KOD'!$A$1:$E$70,5,0),\"\")","v":""},"",null,"","","",{"$f":"IF(F47<>\"\",VLOOKUP(C47,Nap.hladiny!$A:$D,2,0),\"\")","v":""},{"$f":"IF(F47<>\"\",VLOOKUP(D47,Pole!$A:$B,2,0),\"\")","v":""},{"$f":"IF(F47<>\"\",VLOOKUP(E47&\"|\"&F47,'IO-KOD'!$A$1:$E$70,3,0),\"\")","v":""},{"$f":"IF(F47<>\"\",VLOOKUP(E47&\"|\"&F47,'IO-KOD'!$A$1:$E$70,4,0),\"\")","v":""},{"$f":"IF(F47<>\"\",VLOOKUP(C47,Nap.hladiny!$A:$D,3,0),\"\")","v":""},"","","","","",{"$f":"IF(F47<>\"\",VLOOKUP(E47&\"|\"&F47,'IO-KOD'!$A$1:$H$70,8,0),\"\")","v":""},{"$f":"IF(W47<>\"\",VLOOKUP(W47,'104-TI'!$A:$B,2,0),\"\")","v":""},null,{"$f":"IF(F47<>\"\",VLOOKUP(E47&\"|\"&F47,'IO-KOD'!$A$1:$M$70,9,0),\"\")","v":""},{"$f":"IF(F47<>\"\",VLOOKUP(E47&\"|\"&F47,'IO-KOD'!$A$1:$M$70,10,0),\"\")","v":""},{"$f":"IF(F47<>\"\",VLOOKUP(E47&\"|\"&F47,'IO-KOD'!$A$1:$M$70,11,0),\"\")","v":""},{"$f":"IF(F47<>\"\",VLOOKUP(E47&\"|\"&F47,'IO-KOD'!$A$1:$M$70,12,0),\"\")","v":""},{"$f":"IF(F47<>\"\",VLOOKUP(E47&\"|\"&F47,'IO-KOD'!$A$1:$M$70,13,0),\"\")","v":""}]
[null,null,null,null,null,null,{"$f":"IF(F48<>\"\",VLOOKUP(E48&\"|\"&F48,'IO-KOD'!$A$1:$E$70,5,0),\"\")","v":""},"",null,"","","",{"$f":"IF(F48<>\"\",VLOOKUP(C48,Nap.hladiny!$A:$D,2,0),\"\")","v":""},{"$f":"IF(F48<>\"\",VLOOKUP(D48,Pole!$A:$B,2,0),\"\")","v":""},{"$f":"IF(F48<>\"\",VLOOKUP(E48&\"|\"&F48,'IO-KOD'!$A$1:$E$70,3,0),\"\")","v":""},{"$f":"IF(F48<>\"\",VLOOKUP(E48&\"|\"&F48,'IO-KOD'!$A$1:$E$70,4,0),\"\")","v":""},{"$f":"IF(F48<>\"\",VLOOKUP(C48,Nap.hladiny!$A:$D,3,0),\"\")","v":""},"","","","","",{"$f":"IF(F48<>\"\",VLOOKUP(E48&\"|\"&F48,'IO-KOD'!$A$1:$H$70,8,0),\"\")","v":""},{"$f":"IF(W48<>\"\",VLOOKUP(W48,'104-TI'!$A:$B,2,0),\"\")","v":""},null,{"$f":"IF(F48<>\"\",VLOOKUP(E48&\"|\"&F48,'IO-KOD'!$A$1:$M$70,9,0),\"\")","v":""},{"$f":"IF(F48<>\"\",VLOOKUP(E48&\"|\"&F48,'IO-KOD'!$A$1:$M$70,10,0),\"\")","v":""},{"$f":"IF(F48<>\"\",VLOOKUP(E48&\"|\"&F48,'IO-KOD'!$A$1:$M$70,11,0),\"\")","v":""},{"$f":"IF(F48<>\"\",VLOOKUP(E48&\"|\"&F48,'IO-KOD'!$A$1:$M$70,12,0),\"\")","v":""},{"$f":"IF(F48<>\"\",VLOOKUP(E48&\"|\"&F48,'IO-KOD'!$A$1:$M$70,13,0),\"\")","v":""}]
[null,null,null,null,null,null,{"$f":"IF(F49<>\"\",VLOOKUP(E49&\"|\"&F49,'IO-KOD'!$A$1:$E$70,5,0),\"\")","v":""},"",null,"","","",{"$f":"IF(F49<>\"\",VLOOKUP(C49,Nap.hladiny!$A:$D,2,0),\"\")","v":""},{"$f":"IF(F49<>\"\",VLOOKUP(D49,Pole!$A:$B,2,0),\"\")","v":""},{"$f":"IF(F49<>\"\",VLOOKUP(E49&\"|\"&F49,'IO-KOD'!$A$1:$E$70,3,0),\"\")","v":""},{"$f":"IF(F49<>\"\",VLOOKUP(E49&\"|\"&F49,'IO-KOD'!$A$1:$E$70,4,0),\"\")","v":""},{"$f":"IF(F49<>\"\",VLOOKUP(C49,Nap.hladiny!$A:$D,3,0),\"\")","v":""},"","","","","",{"$f":"IF(F49<>\"\",VLOOKUP(E49&\"|\"&F49,'IO-KOD'!$A$1:$H$70,8,0),\"\")","v":""},{"$f":"IF(W49<>\"\",VLOOKUP(W49,'104-TI'!$A:$B,2,0),\"\")","v":""},null,{"$f":"IF(F49<>\"\",VLOOKUP(E49&\"|\"&F49,'IO-KOD'!$A$1:$M$70,9,0),\"\")","v":""},{"$f":"IF(F49<>\"\",VLOOKUP(E49&\"|\"&F49,'IO-KOD'!$A$1:$M$70,10,0),\"\")","v":""},{"$f":"IF(F49<>\"\",VLOOKUP(E49&\"|\"&F49,'IO-KOD'!$A$1:$M$70,11,0),\"\")","v":""},{"$f":"IF(F49<>\"\",VLOOKUP(E49&\"|\"&F49,'IO-KOD'!$A$1:$M$70,12,0),\"\")","v":""},{"$f":"IF(F49<>\"\",VLOOKUP(E49&\"|\"&F49,'IO-KOD'!$A$1:$M$70,13,0),\"\")","v":""}]
[null,null,null,null,null,null,{"$f":"IF(F50<>\"\",VLOOKUP(E50&\"|\"&F50,'IO-KOD'!$A$1:$E$70,5,0),\"\")","v":""},"",null,"","","",{"$f":"IF(F50<>\"\",VLOOKUP(C50,Nap.hladiny!$A:$D,2,0),\"\")","v":""},{"$f":"IF(F50<>\"\",VLOOKUP(D50,Pole!$A:$B,2,0),\"\")","v":""},{"$f":"IF(F50<>\"\",VLOOKUP(E50&\"|\"&F50,'IO-KOD'!$A$1:$E$70,3,0),\"\")","v":""},{"$f":"IF(F50<>\"\",VLOOKUP(E50&\"|\"&F50,'IO-KOD'!$A$1:$E$70,4,0),\"\")","v":""},{"$f":"IF(F50<>\"\",VLOOKUP(C50,Nap.hladiny!$A:$D,3,0),\"\")","v":""},"","","","","",{"$f":"IF(F50<>\"\",VLOOKUP(E50&\"|\"&F50,'IO-KOD'!$A$1:$H$70,8,0),\"\")","v":""},{"$f":"IF(W50<>\"\",VLOOKUP(W50,'104-TI'!$A:$B,2,0),\"\")","v":""},null,{"$f":"IF(F50<>\"\",VLOOKUP(E50&\"|\"&F50,'IO-KOD'!$A$1:$M$70,9,0),\"\")","v":""},{"$f":"IF(F50<>\"\",VLOOKUP(E50&\"|\"&F50,'IO-KOD'!$A$1:$M$70,10,0),\"\")","v":""},{"$f":"IF(F50<>\"\",VLOOKUP(E50&\"|\"&F50,'IO-KOD'!$A$1:$M$70,11,0),\"\")","v":""},{"$f":"IF(F50<>\"\",VLOOKUP(E50&\"|\"&F50,'IO-KOD'!$A$1:$M$70,12,0),\"\")","v":""},{"$f":"IF(F50<>\"\",VLOOKUP(E50&\"|\"&F50,'IO-KOD'!$A$1:$M$70,13,0),\"\")","v":""}]
[null,null,null,null,null,null,{"$f":"IF(F51<>\"\",VLOOKUP(E51&\"|\"&F51,'IO-KOD'!$A$1:$E$70,5,0),\"\")","v":""},"",null,"","","",{"$f":"IF(F51<>\"\",VLOOKUP(C51,Nap.hladiny!$A:$D,2,0),\"\")","v":""},{"$f":"IF(F51<>\"\",VLOOKUP(D51,Pole!$A:$B,2,0),\"\")","v":""},{"$f":"IF(F51<>\"\",VLOOKUP(E51&\"|\"&F51,'IO-KOD'!$A$1:$E$70,3,0),\"\")","v":""},{"$f":"IF(F51<>\"\",VLOOKUP(E51&\"|\"&F51,'IO-KOD'!$A$1:$E$70,4,0),\"\")","v":""},{"$f":"IF(F51<>\"\",VLOOKUP(C51,Nap.hladiny!$A:$D,3,0),\"\")","v":""},"","","","","",{"$f":"IF(F51<>\"\",VLOOKUP(E51&\"|\"&F51,'IO-KOD'!$A$1:$H$70,8,0),\"\")","v":""},{"$f":"IF(W51<>\"\",VLOOKUP(W51,'104-TI'!$A:$B,2,0),\"\")","v":""},null,{"$f":"IF(F51<>\"\",VLOOKUP(E51&\"|\"&F51,'IO-KOD'!$A$1:$M$70,9,0),\"\")","v":""},{"$f":"IF(F51<>\"\",VLOOKUP(E51&\"|\"&F51,'IO-KOD'!$A$1:$M$70,10,0),\"\")","v":""},{"$f":"IF(F51<>\"\",VLOOKUP(E51&\"|\"&F51,'IO-KOD'!$A$1:$M$70,11,0),\"\")","v":""},{"$f":"IF(F51<>\"\",VLOOKUP(E51&\"|\"&F51,'IO-KOD'!$A$1:$M$70,12,0),\"\")","v":""},{"$f":"IF(F51<>\"\",VLOOKUP(E51&\"|\"&F51,'IO-KOD'!$A$1:$M$70,13,0),\"\")","v":""}]
[null,null,null,null,null,null,{"$f":"IF(F52<>\"\",VLOOKUP(E52&\"|\"&F52,'IO-KOD'!$A$1:$E$70,5,0),\"\")","v":""},"",null,"","","",{"$f":"IF(F52<>\"\",VLOOKUP(C52,Nap.hladiny!$A:$D,2,0),\"\")","v":""},{"$f":"IF(F52<>\"\",VLOOKUP(D52,Pole!$A:$B,2,0),\"\")","v":""},{"$f":"IF(F52<>\"\",VLOOKUP(E52&\"|\"&F52,'IO-KOD'!$A$1:$E$70,3,0),\"\")","v":""},{"$f":"IF(F52<>\"\",VLOOKUP(E52&\"|\"&F52,'IO-KOD'!$A$1:$E$70,4,0),\"\")","v":""},{"$f":"IF(F52<>\"\",VLOOKUP(C52,Nap.hladiny!$A:$D,3,0),\"\")","v":""},"","","","","",{"$f":"IF(F52<>\"\",VLOOKUP(E52&\"|\"&F52,'IO-KOD'!$A$1:$H$70,8,0),\"\")","v":""},{"$f":"IF(W52<>\"\",VLOOKUP(W52,'104-TI'!$A:$B,2,0),\"\")","v":""},null,{"$f":"IF(F52<>\"\",VLOOKUP(E52&\"|\"&F52,'IO-KOD'!$A$1:$M$70,9,0),\"\")","v":""},{"$f":"IF(F52<>\"\",VLOOKUP(E52&\"|\"&F52,'IO-KOD'!$A$1:$M$70,10,0),\"\")","v":""},{"$f":"IF(F52<>\"\",VLOOKUP(E52&\"|\"&F52,'IO-KOD'!$A$1:$M$70,11,0),\"\")","v":""},{"$f":"IF(F52<>\"\",VLOOKUP(E52&\"|\"&F52,'IO-KOD'!$A$1:$M$70,12,0),\"\")","v":""},{"$f":"IF(F52<>\"\",VLOOKUP(E52&\"|\"&F52,'IO-KOD'!$A$1:$M$70,13,0),\"\")","v":""}]
[null,null,null,null,null,null,{"$f":"IF(F53<>\"\",VLOOKUP(E53&\"|\"&F53,'IO-KOD'!$A$1:$E$70,5,0),\"\")","v":""},"",null,"","","",{"$f":"IF(F53<>\"\",VLOOKUP(C53,Nap.hladiny!$A:$D,2,0),\"\")","v":""},{"$f":"IF(F53<>\"\",VLOOKUP(D53,Pole!$A:$B,2,0),\"\")","v":""},{"$f":"IF(F53<>\"\",VLOOKUP(E53&\"|\"&F53,'IO-KOD'!$A$1:$E$70,3,0),\"\")","v":""},{"$f":"IF(F53<>\"\",VLOOKUP(E53&\"|\"&F53,'IO-KOD'!$A$1:$E$70,4,0),\"\")","v":""},{"$f":"IF(F53<>\"\",VLOOKUP(C53,Nap.hladiny!$A:$D,3,0),\"\")","v":""},"","","","","",{"$f":"IF(F53<>\"\",VLOOKUP(E53&\"|\"&F53,'IO-KOD'!$A$1:$H$70,8,0),\"\")","v":""},{"$f":"IF(W53<>\"\",VLOOKUP(W53,'104-TI'!$A:$B,2,0),\"\")","v":""},null,{"$f":"IF(F53<>\"\",VLOOKUP(E53&\"|\"&F53,'IO-KOD'!$A$1:$M$70,9,0),\"\")","v":""},{"$f":"IF(F53<>\"\",VLOOKUP(E53&\"|\"&F53,'IO-KOD'!$A$1:$M$70,10,0),\"\")","v":""},{"$f":"IF(F53<>\"\",VLOOKUP(E53&\"|\"&F53,'IO-KOD'!$A$1:$M$70,11,0),\"\")","v":""},{"$f":"IF(F53<>\"\",VLOOKUP(E53&\"|\"&F53,'IO-KOD'!$A$1:$M$70,12,0),\"\")","v":""},{"$f":"IF(F53<>\"\",VLOOKUP(E53&\"|\"&F53,'IO-KOD'!$A$1:$M$70,13,0),\"\")","v":""}]
[null,null,null,null,null,null,{"$f":"IF(F54<>\"\",VLOOKUP(E54&\"|\"&F54,'IO-KOD'!$A$1:$E$70,5,0),\"\")","v":""},"",null,"","","",{"$f":"IF(F54<>\"\",VLOOKUP(C54,Nap.hladiny!$A:$D,2,0),\"\")","v":""},{"$f":"IF(F54<>\"\",VLOOKUP(D54,Pole!$A:$B,2,0),\"\")","v":""},{"$f":"IF(F54<>\"\",VLOOKUP(E54&\"|\"&F54,'IO-KOD'!$A$1:$E$70,3,0),\"\")","v":""},{"$f":"IF(F54<>\"\",VLOOKUP(E54&\"|\"&F54,'IO-KOD'!$A$1:$E$70,4,0),\"\")","v":""},{"$f":"IF(F54<>\"\",VLOOKUP(C54,Nap.hladiny!$A:$D,3,0),\"\")","v":""},"","","","","",{"$f":"IF(F54<>\"\",VLOOKUP(E54&\"|\"&F54,'IO-KOD'!$A$1:$H$70,8,0),\"\")","v":""},{"$f":"IF(W54<>\"\",VLOOKUP(W54,'104-TI'!$A:$B,2,0),\"\")","v":""},null,{"$f":"IF(F54<>\"\",VLOOKUP(E54&\"|\"&F54,'IO-KOD'!$A$1:$M$70,9,0),\"\")","v":""},{"$f":"IF(F54<>\"\",VLOOKUP(E54&\"|\"&F54,'IO-KOD'!$A$1:$M$70,10,0),\"\")","v":""},{"$f":"IF(F54<>\"\",VLOOKUP(E54&\"|\"&F54,'IO-KOD'!$A$1:$M$70,11,0),\"\")","v":""},{"$f":"IF(F54<>\"\",VLOOKUP(E54&\"|\"&F54,'IO-KOD'!$A$1:$M$70,12,0),\"\")","v":""},{"$f":"IF(F54<>\"\",VLOOKUP(E54&\"|\"&F54,'IO-KOD'!$A$1:$M$70,13,0),\"\")","v":""}]
[null,null,null,null,null,null,{"$f":"IF(F55<>\"\",VLOOKUP(E55&\"|\"&F55,'IO-KOD'!$A$1:$E$70,5,0),\"\")","v":""},"",null,"","","",{"$f":"IF(F55<>\"\",VLOOKUP(C55,Nap.hladiny!$A:$D,2,0),\"\")","v":""},{"$f":"IF(F55<>\"\",VLOOKUP(D55,Pole!$A:$B,2,0),\"\")","v":""},{"$f":"IF(F55<>\"\",VLOOKUP(E55&\"|\"&F55,'IO-KOD'!$A$1:$E$70,3,0),\"\")","v":""},{"$f":"IF(F55<>\"\",VLOOKUP(E55&\"|\"&F55,'IO-KOD'!$A$1:$E$70,4,0),\"\")","v":""},{"$f":"IF(F55<>\"\",VLOOKUP(C55,Nap.hladiny!$A:$D,3,0),\"\")","v":""},"","","","","",{"$f":"IF(F55<>\"\",VLOOKUP(E55&\"|\"&F55,'IO-KOD'!$A$1:$H$70,8,0),\"\")","v":""},{"$f":"IF(W55<>\"\",VLOOKUP(W55,'104-TI'!$A:$B,2,0),\"\")","v":""},null,{"$f":"IF(F55<>\"\",VLOOKUP(E55&\"|\"&F55,'IO-KOD'!$A$1:$M$70,9,0),\"\")","v":""},{"$f":"IF(F55<>\"\",VLOOKUP(E55&\"|\"&F55,'IO-KOD'!$A$1:$M$70,10,0),\"\")","v":""},{"$f":"IF(F55<>\"\",VLOOKUP(E55&\"|\"&F55,'IO-KOD'!$A$1:$M$70,11,0),\"\")","v":""},{"$f":"IF(F55<>\"\",VLOOKUP(E55&\"|\"&F55,'IO-KOD'!$A$1:$M$70,12,0),\"\")","v":""},{"$f":"IF(F55<>\"\",VLOOKUP(E55&\"|\"&F55,'IO-KOD'!$A$1:$M$70,13,0),\"\")","v":""}]
[null,null,null,null,null,null,{"$f":"IF(F56<>\"\",VLOOKUP(E56&\"|\"&F56,'IO-KOD'!$A$1:$E$70,5,0),\"\")","v":""},"",null,"","","",{"$f":"IF(F56<>\"\",VLOOKUP(C56,Nap.hladiny!$A:$D,2,0),\"\")","v":""},{"$f":"IF(F56<>\"\",VLOOKUP(D56,Pole!$A:$B,2,0),\"\")","v":""},{"$f":"IF(F56<>\"\",VLOOKUP(E56&\"|\"&F56,'IO-KOD'!$A$1:$E$70,3,0),\"\")","v":""},{"$f":"IF(F56<>\"\",VLOOKUP(E56&\"|\"&F56,'IO-KOD'!$A$1:$E$70,4,0),\"\")","v":""},{"$f":"IF(F56<>\"\",VLOOKUP(C56,Nap.hladiny!$A:$D,3,0),\"\")","v":""},"","","","","",{"$f":"IF(F56<>\"\",VLOOKUP(E56&\"|\"&F56,'IO-KOD'!$A$1:$H$70,8,0),\"\")","v":""},{"$f":"IF(W56<>\"\",VLOOKUP(W56,'104-TI'!$A:$B,2,0),\"\")","v":""},null,{"$f":"IF(F56<>\"\",VLOOKUP(E56&\"|\"&F56,'IO-KOD'!$A$1:$M$70,9,0),\"\")","v":""},{"$f":"IF(F56<>\"\",VLOOKUP(E56&\"|\"&F56,'IO-KOD'!$A$1:$M$70,10,0),\"\")","v":""},{"$f":"IF(F56<>\"\",VLOOKUP(E56&\"|\"&F56,'IO-KOD'!$A$1:$M$70,11,0),\"\")","v":""},{"$f":"IF(F56<>\"\",VLOOKUP(E56&\"|\"&F56,'IO-KOD'!$A$1:$M$70,12,0),\"\")","v":""},{"$f":"IF(F56<>\"\",VLOOKUP(E56&\"|\"&F56,'IO-KOD'!$A$1:$M$70,13,0),\"\")","v":""}]
[null,null,null,null,null,null,{"$f":"IF(F57<>\"\",VLOOKUP(E57&\"|\"&F57,'IO-KOD'!$A$1:$E$70,5,0),\"\")","v":""},"",null,"","","",{"$f":"IF(F57<>\"\",VLOOKUP(C57,Nap.hladiny!$A:$D,2,0),\"\")","v":""},{"$f":"IF(F57<>\"\",VLOOKUP(D57,Pole!$A:$B,2,0),\"\")","v":""},{"$f":"IF(F57<>\"\",VLOOKUP(E57&\"|\"&F57,'IO-KOD'!$A$1:$E$70,3,0),\"\")","v":""},{"$f":"IF(F57<>\"\",VLOOKUP(E57&\"|\"&F57,'IO-KOD'!$A$1:$E$70,4,0),\"\")","v":""},{"$f":"IF(F57<>\"\",VLOOKUP(C57,Nap.hladiny!$A:$D,3,0),\"\")","v":""},"","","","","",{"$f":"IF(F57<>\"\",VLOOKUP(E57&\"|\"&F57,'IO-KOD'!$A$1:$H$70,8,0),\"\")","v":""},{"$f":"IF(W57<>\"\",VLOOKUP(W57,'104-TI'!$A:$B,2,0),\"\")","v":""},null,{"$f":"IF(F57<>\"\",VLOOKUP(E57&\"|\"&F57,'IO-KOD'!$A$1:$M$70,9,0),\"\")","v":""},{"$f":"IF(F57<>\"\",VLOOKUP(E57&\"|\"&F57,'IO-KOD'!$A$1:$M$70,10,0),\"\")","v":""},{"$f":"IF(F57<>\"\",VLOOKUP(E57&\"|\"&F57,'IO-KOD'!$A$1:$M$70,11,0),\"\")","v":""},{"$f":"IF(F57<>\"\",VLOOKUP(E57&\"|\"&F57,'IO-KOD'!$A$1:$M$70,12,0),\"\")","v":""},{"$f":"IF(F57<>\"\",VLOOKUP(E57&\"|\"&F57,'IO-KOD'!$A$1:$M$70,13,0),\"\")","v":""}]
[null,null,null,null,null,null,{"$f":"IF(F58<>\"\",VLOOKUP(E58&\"|\"&F58,'IO-KOD'!$A$1:$E$70,5,0),\"\")","v":""},"",null,"","","",{"$f":"IF(F58<>\"\",VLOOKUP(C58,Nap.hladiny!$A:$D,2,0),\"\")","v":""},{"$f":"IF(F58<>\"\",VLOOKUP(D58,Pole!$A:$B,2,0),\"\")","v":""},{"$f":"IF(F58<>\"\",VLOOKUP(E58&\"|\"&F58,'IO-KOD'!$A$1:$E$70,3,0),\"\")","v":""},{"$f":"IF(F58<>\"\",VLOOKUP(E58&\"|\"&F58,'IO-KOD'!$A$1:$E$70,4,0),\"\")","v":""},{"$f":"IF(F58<>\"\",VLOOKUP(C58,Nap.hladiny!$A:$D,3,0),\"\")","v":""},"","","","","",{"$f":"IF(F58<>\"\",VLOOKUP(E58&\"|\"&F58,'IO-KOD'!$A$1:$H$70,8,0),\"\")","v":""},{"$f":"IF(W58<>\"\",VLOOKUP(W58,'104-TI'!$A:$B,2,0),\"\")","v":""},null,{"$f":"IF(F58<>\"\",VLOOKUP(E58&\"|\"&F58,'IO-KOD'!$A$1:$M$70,9,0),\"\")","v":""},{"$f":"IF(F58<>\"\",VLOOKUP(E58&\"|\"&F58,'IO-KOD'!$A$1:$M$70,10,0),\"\")","v":""},{"$f":"IF(F58<>\"\",VLOOKUP(E58&\"|\"&F58,'IO-KOD'!$A$1:$M$70,11,0),\"\")","v":""},{"$f":"IF(F58<>\"\",VLOOKUP(E58&\"|\"&F58,'IO-KOD'!$A$1:$M$70,12,0),\"\")","v":""},{"$f":"IF(F58<>\"\",VLOOKUP(E58&\"|\"&F58,'IO-KOD'!$A$1:$M$70,13,0),\"\")","v":""}]
[null,null,null,null,null,null,{"$f":"IF(F59<>\"\",VLOOKUP(E59&\"|\"&F59,'IO-KOD'!$A$1:$E$70,5,0),\"\")","v":""},"",null,"","","",{"$f":"IF(F59<>\"\",VLOOKUP(C59,Nap.hladiny!$A:$D,2,0),\"\")","v":""},{"$f":"IF(F59<>\"\",VLOOKUP(D59,Pole!$A:$B,2,0),\"\")","v":""},{"$f":"IF(F59<>\"\",VLOOKUP(E59&\"|\"&F59,'IO-KOD'!$A$1:$E$70,3,0),\"\")","v":""},{"$f":"IF(F59<>\"\",VLOOKUP(E59&\"|\"&F59,'IO-KOD'!$A$1:$E$70,4,0),\"\")","v":""},{"$f":"IF(F59<>\"\",VLOOKUP(C59,Nap.hladiny!$A:$D,3,0),\"\")","v":""},"","","","","",{"$f":"IF(F59<>\"\",VLOOKUP(E59&\"|\"&F59,'IO-KOD'!$A$1:$H$70,8,0),\"\")","v":""},{"$f":"IF(W59<>\"\",VLOOKUP(W59,'104-TI'!$A:$B,2,0),\"\")","v":""},null,{"$f":"IF(F59<>\"\",VLOOKUP(E59&\"|\"&F59,'IO-KOD'!$A$1:$M$70,9,0),\"\")","v":""},{"$f":"IF(F59<>\"\",VLOOKUP(E59&\"|\"&F59,'IO-KOD'!$A$1:$M$70,10,0),\"\")","v":""},{"$f":"IF(F59<>\"\",VLOOKUP(E59&\"|\"&F59,'IO-KOD'!$A$1:$M$70,11,0),\"\")","v":""},{"$f":"IF(F59<>\"\",VLOOKUP(E59&\"|\"&F59,'IO-KOD'!$A$1:$M$70,12,0),\"\")","v":""},{"$f":"IF(F59<>\"\",VLOOKUP(E59&\"|\"&F59,'IO-KOD'!$A$1:$M$70,13,0),\"\")","v":""}]

{"sheet":"Nap.hladiny","index":5,"n_rows":10,"n_cols":4,"rows_kept":10,"cut":false,"hidden":true,"merged":[[0,0,0,3]]}
["Napěťové hladiny"]
["TA_NAP","A","E","Subsystém"]
[110,1,0,"110 kV"]
[35,2,0,"35 kV"]
[22,3,0,"22 kV"]
[10,4,0,"10 kV"]
["NNO",5,0,"0,4 kV odběratele"]
["SPL",6,0,"Společné provozy"]
["NN1",7,0,"0,4 kV"]
["NN2",7,1,"0,4 kV"]

{"sheet":"Pole","index":6,"n_rows":47,"n_cols":3,"rows_kept":47,"cut":false,"hidden":true,"merged":[[0,0,0,2]]}
["Pole"]
["TA_POLE","B","Poznámka"]
[0,0,"Společné provozy"]
["EZS",0,"Elektronický zabezpečovací systém"]
[1,1]
[2,2]
[3,3]
[4,4]
[5,5]
[6,6]
[7,7]
[8,8]
[9,9]
[10,10]
[11,11]
[12,12]
[13,13]
[14,14]
[15,15]
[16,16]
[17,17]
[18,18]
[19,19]
[20,20]
[81,81,"Přípojnice NN trafa T1"]
[82,82,"Přípojnice NN trafa T2"]
[83,83,"Přípojnice NN trafa T3"]
[84,84,"Přípojnice NN trafa T4"]
[85,85,"Přípojnice NN trafa T5"]
[86,86,"Přípojnice NN trafa T6"]
[87,87,"Přípojnice NN trafa T7"]
[88,88,"Přípojnice NN trafa T8"]
[89,89,"Přípojnice NN trafa T9"]
["W11",101,"Přípojnice A1"]
["W12",102,"Přípojnice A2"]
["W13",103,"Přípojnice A3"]
["W14",104,"Přípojnice A4"]
["W21",105,"Přípojnice B1"]
["W22",106,"Přípojnice B2"]
["W23",107,"Přípojnice B3"]
["W24",108,"Přípojnice B4"]
["VMS",120,"Výrobní modul - společné"]
["VM1",121,"Výrobní modul 1 (NN)"]
["VM2",122,"Výrobní modul 2 (NN)"]
["VM3",123,"Výrobní modul 3 (NN)"]
["VM4",124,"Výrobní modul 4 (NN)"]
["VM5",125,"Výrobní modul 5 (NN)"]

{"sheet":"IO-KOD","index":7,"n_rows":58,"n_cols":13,"rows_kept":58,"cut":false,"hidden":true,"merged":[]}
["OZN+TYP","TA_OZN","C","D","POPIS","ZKRÁCENÝ TEXT","TA_TYP","TI_IEC","LAB0","LAB1","LAB2","LAB3","UNIT"]
[{"$f":"G2&\"|\"&B2","v":"S|QM"},"QM",0,1,"Vypínač QM - stav","Vypínač QM","S",31,"MEZIPOLOHA","VYPNUTO","ZAPNUTO","PORUCHA","-"]
[{"$f":"G3&\"|\"&B3","v":"S|Q6"},"Q6",0,17,"Odpojovač Q6 - stav","Odpojovač Q6","S",31,"MEZIPOLOHA","VYPNUTO","ZAPNUTO","PORUCHA","-"]
["S|QE6","QE6",0,96,"Uzemňovač QE6 - stav","Uzemňovač QE6","S",31,"MEZIPOLOHA","VYPNUTO","ZAPNUTO","PORUCHA","-"]
["S|QS1","QS1",0,124,"Odpínač QS1 - stav","Odpínač QS1","S",31,"MEZIPOLOHA","VYPNUTO","ZAPNUTO","PORUCHA","-"]
["S|QSF1","QSF1",0,127,"Odpínač s pojistkou QSF1 - stav","Odpínač QSF1","S",31,"MEZIPOLOHA","VYPNUTO","ZAPNUTO","PORUCHA","-"]
["S|FA1","FA1",0,142,"Jistič FA1 - stav","Jistič FA1","S",31,"MEZIPOLOHA","VYPNUTO","ZAPNUTO","PORUCHA","-"]
["S|FA2","FA2",0,143,"Jistič FA2 - stav","Jistič FA2","S",31,"MEZIPOLOHA","VYPNUTO","ZAPNUTO","PORUCHA","-"]
["S|FA3","FA3",0,144,"Jistič FA3 - stav","Jistič FA3","S",31,"MEZIPOLOHA","VYPNUTO","ZAPNUTO","PORUCHA","-"]
["S|FA4","FA4",0,145,"Jistič FA4 - stav","Jistič FA4","S",31,"MEZIPOLOHA","VYPNUTO","ZAPNUTO","PORUCHA","-"]
["S|QM_TEST","QM_TEST",0,255,"Zkušební vypínač - stav","Zk.vyp.","S",31,"MEZIPOLOHA","VYPNUTO","ZAPNUTO","PORUCHA","-"]
["P|H100T","H100T",1,1,"Ochrany - působení ochran","Ochrany-půs.ochran","P",30,"KONEC","ZAČÁTEK","-","-","-"]
["P|H100IF","H100IF",2,17,"Ochrany - vnitřní porucha","Ochrany-vnitř.por.","P",30,"KONEC","ZAČÁTEK","-","-","-"]
["S|SPFG090C","SPFG090C",6,226,"Stupeň regulace cos fi - 0.90C - nastaveno","Stupeň regulace cosfi-0,90C","S",30,"VYPNUTO","ZAPNUTO","-","-","-"]
["S|SPFG095C","SPFG095C",6,227,"Stupeň regulace cos fi - 0.95C - nastaveno","Stupeň regulace cosfi-0,95C","S",30,"VYPNUTO","ZAPNUTO","-","-","-"]
["S|SPFG100","SPFG100",6,228,"Stupeň regulace cos fi - 1.00 - nastaveno","Stupeň regulace cosfi-1,00","S",30,"VYPNUTO","ZAPNUTO","-","-","-"]
["S|SPFG095L","SPFG095L",6,229,"Stupeň regulace cos fi - 0.95L - nastaveno","Stupeň regulace cosfi-0,95L","S",30,"VYPNUTO","ZAPNUTO","-","-","-"]
["S|SPFG090L","SPFG090L",6,230,"Stupeň regulace cos fi - 0.90L - nastaveno","Stupeň regulace cosfi-0,90L","S",30,"VYPNUTO","ZAPNUTO","-","-","-"]
["S|SPG100","SPG100",6,232,"Stupeň regulace P - výroba 100% - nastaveno","Stupeň regulace P-výroba 100% ","S",30,"VYPNUTO","ZAPNUTO","-","-","-"]
["S|SPG060","SPG060",6,233,"Stupeň regulace P - výroba 60% - nastaveno","Stupeň regulace P-výroba 60% ","S",30,"VYPNUTO","ZAPNUTO","-","-","-"]
["S|SPG030","SPG030",6,234,"Stupeň regulace P - výroba 30% - nastaveno","Stupeň regulace P-výroba 30% ","S",30,"VYPNUTO","ZAPNUTO","-","-","-"]
["S|SPG000","SPG000",6,235,"Stupeň regulace P - výroba 0% - nastaveno","Stupeň regulace P-výroba 0% ","S",30,"VYPNUTO","ZAPNUTO","-","-","-"]
["S|SPG075","SPG075",6,236,"Stupeň regulace P - výroba 75% - nastaveno","Stupeň regulace P-výroba 75% ","S",30,"VYPNUTO","ZAPNUTO","-","-","-"]
["S|SPG050","SPG050",6,237,"Stupeň regulace P - výroba 50% - nastaveno","Stupeň regulace P-výroba 50% ","S",30,"VYPNUTO","ZAPNUTO","-","-","-"]
["P|H835L","H835L",7,128,"Stejnosměrné napájení ovládání - ztráta napětí","Ss.nap.ovl.-ztr.U","P",30,"KONEC","ZAČÁTEK","-","-","-"]
["P|H842L","H842L",8,43,"Střídavé napájení ovládání - ztráta napětí","Stř.nap.ovládání-ztr.U","P",30,"KONEC","ZAČÁTEK","-","-","-"]
["Z|QM","QM",10,1,"Vypínač QM - povel","Vypínač QM","Z",46,"-","VYPNOUT","ZAPNOUT","-","-"]
["Z|QS1","QS1",10,128,"Odpínač QS1 - povel","Odpínač QS1","Z",46,"-","VYPNOUT","ZAPNOUT","-","-"]
["Z|QSF1","QSF1",10,131,"Odpínač QSF1 - povel","Odpínač QSF1","Z",46,"-","VYPNOUT","ZAPNOUT","-","-"]
["Z|FA1","FA1",10,136,"Jistič FA1 - povel","Jistič FA1","Z",46,"-","VYPNOUT","ZAPNOUT","-","-"]
["Z|FA2","FA2",10,137,"Jistič FA2 - povel","Jistič FA2","Z",46,"-","VYPNOUT","ZAPNOUT","-","-"]
["Z|FA3","FA3",10,138,"Jistič FA3 - povel","Jistič FA3","Z",46,"-","VYPNOUT","ZAPNOUT","-","-"]
["Z|FA4","FA4",10,139,"Jistič FA4 - povel","Jistič FA4","Z",46,"-","VYPNOUT","ZAPNOUT","-","-"]
["Z|QM_TEST","QM_TEST",10,255,"Zkušební vypínač - povel","Zk.vyp.","Z",46,"-","VYPNOUT","ZAPNOUT","-","-"]
["Z|SPG100","SPG100",12,81,"Stupeň regulace P - výroba 100% - nastavit","Stupeň regulace P-výroba 100%","Z",45,"VYPNOUT","ZAPNOUT","-","-","-"]
["Z|SPG060","SPG060",12,82,"Stupeň regulace P - výroba 60% - nastavit","Stupeň regulace P-výroba 60%","Z",45,"VYPNOUT","ZAPNOUT","-","-","-"]
["Z|SPG030","SPG030",12,83,"Stupeň regulace P - výroba 30% - nastavit","Stupeň regulace P-výroba 30%","Z",45,"VYPNOUT","ZAPNOUT","-","-","-"]
["Z|SPG000","SPG000",12,84,"Stupeň regulace P - výroba 0% - nastavit","Stupeň regulace P-výroba 0%","Z",45,"VYPNOUT","ZAPNOUT","-","-","-"]
["Z|SPG075","SPG075",12,85,"Stupeň regulace P - výroba 75% - nastavit","Stupeň regulace P-výroba 75%","Z",45,"VYPNOUT","ZAPNOUT","-","-","-"]
["Z|SPG050","SPG050",12,86,"Stupeň regulace P - výroba 50% - nastavit","Stupeň regulace P-výroba 50%","Z",45,"VYPNOUT","ZAPNOUT","-","-","-"]
["Z|SPFG090C","SPFG090C",12,127,"Stupeň regulace cos fi - 0.90C - nastavit","Stupeň regulace cosfi-0,90C","Z",45,"VYPNOUT","ZAPNOUT","-","-","-"]
["Z|SPFG095C","SPFG095C",12,128,"Stupeň regulace cos fi - 0.95C - nastavit","Stupeň regulace cosfi-0,95C","Z",45,"VYPNOUT","ZAPNOUT","-","-","-"]
["Z|SPFG100","SPFG100",12,129,"Stupeň regulace cos fi - 1.00 - nastavit","Stupeň regulace cosfi-1,00","Z",45,"VYPNOUT","ZAPNOUT","-","-","-"]
["Z|SPFG095L","SPFG095L",12,130,"Stupeň regulace cos fi - 0.95L - nastavit","Stupeň regulace cosfi-0,95L","Z",45,"VYPNOUT","ZAPNOUT","-","-","-"]
["Z|SPFG090L","SPFG090L",12,131,"Stupeň regulace cos fi - 0.90L - nastavit","Stupeň regulace cosfi-0,90L","Z",45,"VYPNOUT","ZAPNOUT","-","-","-"]
["M|IL1","IL1",13,1,"Měření proudu IL1","Proud IL1","M",13,"-","-","-","-","A"]
["M|IL2","IL2",13,2,"Měření proudu IL2","Proud IL2","M",13,"-","-","-","-","A"]
["M|IL3","IL3",13,3,"Měření proudu IL3","Proud IL3","M",13,"-","-","-","-","A"]
["M|UL1","UL1",13,9,"Měření fázového napětí UL1","Fázové napětí UL1","M",13,"-","-","-","-","V"]
["M|UL2","UL2",13,10,"Měření fázového napětí UL2","Fázové napětí UL2","M",13,"-","-","-","-","V"]
["M|UL3","UL3",13,11,"Měření fázového napětí UL3","Fázové napětí UL3","M",13,"-","-","-","-","V"]
["M|UL1-L2","UL1-L2",13,16,"Měření sdruženého napětí L1-L2","Sdružené napětí L1-L2","M",13,"-","-","-","-","V"]
["M|UL2-L3","UL2-L3",13,17,"Měření sdruženého napětí L2-L3","Sdružené napětí L2-L3","M",13,"-","-","-","-","V"]
["M|UL1-L3","UL1-L3",13,18,"Měření sdruženého napětí L1-L3","Sdružené napětí L1-L3","M",13,"-","-","-","-","V"]
["M|P","P",13,22,"Měření činného výkonu P","Činný výkon P","M",13,"-","-","-","-","kW"]
["M|Q","Q",13,23,"Měření jalového výkonu Q","Jalový výkon Q","M",13,"-","-","-","-","kvar"]
["S|H298CEB","H298CEB",6,224,"Automatika výrobny - blokování zapnutí","Aut.vyr.-blok.zap.","S",30,"VYPNUTO","ZAPNUTO","-","-","-"]
["Z|H298CEB","H298CEB",6,225,"Automatika výrobny - blokování zapnutí - povel","Aut.vyr.-blok.zap.","Z",46,"-","VYPNOUT","ZAPNOUT","-","-"]

{"sheet":"104-TI","index":8,"n_rows":25,"n_cols":4,"rows_kept":25,"cut":false,"hidden":true,"merged":[[0,0,0,3]]}
["Datové typy IEC 60870-5-101/104"]
["TI_IEC","TI_OZN","Význam - ENG","Význam - CZ"]
[1,"M_SP_NA_1","Single-point information","Jednobitová informace"]
[30,"M_SP_TB_1","Single-point information with time tag","Jednobitová informace s časovou známkou"]
[3,"M_DP_NA_1","Double-point information","Dvoubitová informace"]
[31,"M_DP_TB_1","Double-point information with time tag","Dvoubitová informace s časovou známkou"]
[5,"M_ST_NA_1","Step position information","Signalizace polohy"]
[32,"M_ST_TB_1","Step position information with time tag","Signalizace polohy s časovou známkou"]
[]
[45,"C_SC_NA_1","Single command","Jednobitový povel"]
[58,"C_SC_TA_1","Single command with time tag","Jednobitový povel s časovou známkou"]
[46,"C_DC_NA_1","Double command","Dvoubitový povel"]
[59,"C_DC_TA_1","Double command with time tag","Dvoubitový povel s časovou známkou"]
[47,"C_RC_NA_1","Regulating step command","Regulační krokový povel"]
[60,"C_RC_TA_1","Regulating step command with time tag","Regulační krokový povel s časovou známkou"]
[50,"C_SE_NC_1","Set point command, short floating point number","Nastavená hodnota"]
[]
[9,"M_ME_NA_1","Measured value, normalized value","Měřená hodnota normalizovaná"]
[34,"M_ME_TD_1","Measured value, normalized value with time tag","Měřená hodnota normalizovaná s časovou známkou"]
[11,"M_ME_NB_1","Measured value, scaled value","Měřená hodnota s měřítkem"]
[35,"M_ME_TE_1","Measured value, scaled value with time tag","Měřená hodnota s měřítkem s časovou známkou"]
[13,"M_ME_NC_1","Measured value, short floating point number","Měřená hodnota v krátké poh.řád.čárce"]
[36,"M_ME_TF_1","Measured value, short floating point number with time tag","Měřená hodn.v krátké poh.řád.čárce s čas.známkou"]
[15,"M_IT_NA_1","Integrated totals","Integrované součty"]
[37,"M_IT_TB_1","Integrated totals with time tag","Integrované součty s časovou známkou"]